Benzene, nonadecyl-

Phase change data

Data compiled as indicated in comments:
TRC - Thermodynamics Research Center, NIST Boulder Laboratories, Chris Muzny director
AC - William E. Acree, Jr., James S. Chickos

Quantity Value Units Method Reference Comment
Tfus298.16KN/AChu, Sindilariu, et al., 1986Uncertainty assigned by TRC = 0.4 K; TRC
Tfus298.1KN/AMeyer and Meyer, 1983Metastable crystal phase; Uncertainty assigned by TRC = 0.03 K; TRC
Tfus302.7KN/AMeyer and Meyer, 1983Uncertainty assigned by TRC = 0.04 K; TRC

Enthalpy of vaporization

ΔvapH (kJ/mol) Temperature (K) Reference Comment
103.6446.Dykyj, Svoboda, et al., 1999Based on data from 431. - 686. K.; AC

In addition to the Thermodynamics Research Center (TRC) data available from this site, much more physical and chemical property data is available from the following TRC products:

References

Chu, Sindilariu, et al., 1986
Chu, L.T.; Sindilariu, C.; Freilich, A.; Fried, V., Some physical properties of long chain hydrocarbons, Can. J. Chem., 1986, 64, 481. [all data]

Meyer and Meyer, 1983
Meyer, E.F.; Meyer, M.C., Solid-Liquid Behaviur of Nonadecylcyclohexane and Nonadecylbenzene, J. Chem. Eng. Data, 1983, 28, 148-50. [all data]

Dykyj, Svoboda, et al., 1999
Dykyj, J.; Svoboda, J.; Wilhoit, R.C.; Frenkel, M.L.; Hall, K.R., Vapor Pressure of Chemicals: Part A. Vapor Pressure and Antoine Constants for Hydrocarbons and Sulfur, Selenium, Tellurium and Hydrogen Containing Organic Compounds, Springer, Berlin, 1999, 373. [all data]