1,3,5-Trithiane

Phase change data

Data compiled by: William E. Acree, Jr., James S. Chickos

Quantity Value Units Method Reference Comment
Δsub93.2 ± 0.2kJ/molMERoux, Jiménez, et al., 2001
Δsub93.9kJ/molN/ADe Wit, Van Miltenburg, et al., 1983

Enthalpy of sublimation

ΔsubH (kJ/mol) Temperature (K) Method Reference Comment
91.5331.TE,MEDe Wit, Van Miltenburg, et al., 1983Based on data from 320. - 339. K.

Enthalpy of fusion

ΔfusH (kJ/mol) Temperature (K) Reference
32.2488.4van Miltenburg and van Ekeren, 2002

Gas phase ion energetics data

Data compiled as indicated in comments:
LLK - Sharon G. Lias, Rhoda D. Levin, and Sherif A. Kafafi

Ionization energy determinations

IE (eV) Method Reference Comment
7.7PEBock, Schulz, et al., 1981LLK
8.58PEBock, Schulz, et al., 1981Vertical value; LLK
8.83 ± 0.05PEKroto, Landsberg, et al., 1974Vertical value; LLK
8.76PESweigart and Turner, 1972Vertical value; LLK

Van Den Dool and Kratz RI, non-polar column, temperature ramp

View large format table.

Column type Active phase I Reference Comment
CapillaryBPX-51271.Ames, Guy, et al., 200150. m/0.32 mm/0.5 μm, He, 60. C @ 5. min, 4. K/min, 250. C @ 10. min
CapillaryOV-11259.Chen and Ho, 1986H2, 4. K/min, 280. C @ 50. min; Column length: 50. m; Column diameter: 0.2 mm; Tstart: 50. C

Normal alkane RI, non-polar column, temperature ramp

View large format table.

Column type Active phase I Reference Comment
CapillarySPB-11271.Frerot, Velluz, et al., 200830. m/0.25 mm/1.0 μm, Helium, 60. C @ 5. min, 5. K/min; Tend: 250. C

References

Roux, Jiménez, et al., 2001
Roux, María Victoria; Jiménez, Pilar; Dávalos, Juan Z.; Notario, Rafael; Juaristi, Eusebio, Calorimetric and Computational Study of 1,3,5-Trithiane «8224», J. Org. Chem., 2001, 66, 16, 5343-5351, https://doi.org/10.1021/jo001757b . [all data]

De Wit, Van Miltenburg, et al., 1983
De Wit, H.G.M.; Van Miltenburg, J.C.; De Kruif, C.G., Thermodynamic properties of molecular organic crystals containing nitrogen, oxygen, and sulphur 1. Vapour pressures and enthalpies of sublimation, The Journal of Chemical Thermodynamics, 1983, 15, 7, 651-663, https://doi.org/10.1016/0021-9614(83)90079-4 . [all data]

van Miltenburg and van Ekeren, 2002
van Miltenburg, J.C.; van Ekeren, P.J., Thermodynamic properties of 1,3,5-trithiane derived from solid phase heat capacity measurements by adiabatic calorimetry and DSC measurements in the melting range, Thermochimica Acta, 2002, 385, 1-2, 11-17, https://doi.org/10.1016/S0040-6031(01)00719-5 . [all data]

Bock, Schulz, et al., 1981
Bock, H.; Schulz, W.; Schmidt, M., P. E. spektren und molekuleigenschaften. 89. Ionissationsmuster und konformation von Cyclo-Polythianen (H2CS)n, Z. Anorg. Allg. Chem., 1981, 474, 199. [all data]

Kroto, Landsberg, et al., 1974
Kroto, H.W.; Landsberg, B.M.; Suffolk, R.J.; Vodden, A., The photoelectron and microwave spectra of the unstable species thioacetaldehyde, CH3CHS, and thioacetone, (CH3)2CS, Chem. Phys. Lett., 1974, 29, 265. [all data]

Sweigart and Turner, 1972
Sweigart, D.A.; Turner, D.W., Lone pair orbitals and their interactions studied by photoelectron spectroscopy. II. Equivalent orbitals in saturated oxygen and sulfur J. Heterocycl. Chem., J. Am. Chem. Soc., 1972, 94, 5599. [all data]

Ames, Guy, et al., 2001
Ames, J.M.; Guy, R.C.E.; Kipping, G.J., Effect of pH and temperature on the formation of volatile compounds in cysteine/reducing sugar/starch mixtures during extrusion cooking, J. Agric. Food Chem., 2001, 49, 4, 1885-1894, https://doi.org/10.1021/jf0012547 . [all data]

Chen and Ho, 1986
Chen, C.-C.; Ho, C.-T., Identification of sulfurous compounds of shiitake mushroom (Lentinus edodes Sing.), J. Agric. Food Chem., 1986, 34, 5, 830-833, https://doi.org/10.1021/jf00071a016 . [all data]

Frerot, Velluz, et al., 2008
Frerot, E.; Velluz, A.; Bagnoud, A.; Delort, E., Analysis of the volatile constituents of cooked petai beans (Parkia speciosa) using high-resolution GC/TOF-MS, Flav. Fragr. J., 2008, 23, 6, 434-440, https://doi.org/10.1002/ffj.1902 . [all data]