N,N-Dimethyl-4-t-butylbenzeneamine

Phase change data

Data compiled as indicated in comments:
BS - Robert L. Brown and Stephen E. Stein
TRC - Thermodynamics Research Center, NIST Boulder Laboratories, Chris Muzny director

Quantity Value Units Method Reference Comment
Tboil524.7KN/AAldrich Chemical Company Inc., 1990BS
Tboil493.15KN/ABroxton, Deady, et al., 1970Uncertainty assigned by TRC = 4. K; TRC

In addition to the Thermodynamics Research Center (TRC) data available from this site, much more physical and chemical property data is available from the following TRC products:

Gas phase ion energetics data

Data compiled as indicated in comments:
LBLHLM - Sharon G. Lias, John E. Bartmess, Joel F. Liebman, John L. Holmes, Rhoda D. Levin, and W. Gary Mallard
RDSH - Henry M. Rosenstock, Keith Draxl, Bruce W. Steiner, and John T. Herron

Ionization energy determinations

IE (eV) Method Reference Comment
6.90 ± 0.02EIOrlov, Misharev, et al., 1986LBLHLM
7.43CTSFarrell and Newton, 1965RDSH

Appearance energy determinations

Ion AE (eV) Other Products MethodReferenceComment
C11H16N+9.5 ± 0.1CH3EIOrlov, Misharev, et al., 1986LBLHLM

References

Aldrich Chemical Company Inc., 1990
Aldrich Chemical Company Inc., Catalog Handbook of Fine Chemicals, Aldrich Chemical Company, Inc., Milwaukee WI, 1990, 1. [all data]

Broxton, Deady, et al., 1970
Broxton, T.J.; Deady, L.W.; Katritzky, A.R.; Liu, A.; Topsom, R.D., Infrared Intensities as a Quantitative Measure of Intermolecular Inter- actions XII. π-Distortions in teh Ground States of Some p-Alkylbenzenes, J. Am. Chem. Soc., 1970, 92, 6845. [all data]

Orlov, Misharev, et al., 1986
Orlov, V.; Misharev, A.; Takhistox, V., Determination of the enthalpy of formation of para-substituted α,α-dimethyl cations in the gas phase, Izv. Akad. Nauk SSSR Ser. Khim., 1986, 9, 2006. [all data]

Farrell and Newton, 1965
Farrell, P.G.; Newton, J., Ionization potentials of aromatic amines, J. Phys. Chem., 1965, 69, 3506. [all data]