1,4-Dioxin

Gas phase thermochemistry data

Data compiled by: Glushko Thermocenter, Russian Academy of Sciences, Moscow

Constant pressure heat capacity of gas

Cp,gas (cal/mol*K) Temperature (K) Reference Comment
9.21450.Dorofeeva O.V., 1992p=1 bar.
9.716100.
11.08150.
13.46200.
17.86273.15
19.43 ± 0.84298.15
19.54300.
25.373400.
30.139500.
33.891600.
36.869700.
39.285800.
41.279900.
42.9471000.
44.3571100.
45.5591200.
46.5871300.
47.4711400.
48.2341500.

References

Dorofeeva O.V., 1992
Dorofeeva O.V., Ideal gas thermodynamic properties of oxygen heterocyclic compounds. Part 2. Six-membered, seven-membered and eight-membered rings, Thermochim. Acta, 1992, 200, 121-150. [all data]