Benzonitrile,2,4,6-trimethoxy-N-oxide

Gas phase thermochemistry data

Data compiled by: Hussein Y. Afeefy, Joel F. Liebman, and Stephen E. Stein

Quantity Value Units Method Reference Comment
Δfgas-228.2 ± 2.8kJ/molCcbAcree, Tucker, et al., 1991

Condensed phase thermochemistry data

Data compiled by: Hussein Y. Afeefy, Joel F. Liebman, and Stephen E. Stein

Quantity Value Units Method Reference Comment
Δfsolid-320.1 ± 2.1kJ/molCcbAcree, Tucker, et al., 1991
Quantity Value Units Method Reference Comment
Δcsolid-5187.1 ± 1.6kJ/molCcbAcree, Tucker, et al., 1991

Phase change data

Data compiled as indicated in comments:
AC - William E. Acree, Jr., James S. Chickos
ALS - Hussein Y. Afeefy, Joel F. Liebman, and Stephen E. Stein

Quantity Value Units Method Reference Comment
Δsub87.9 ± 1.9kJ/molN/AAcree, Sevruk, et al., 1993AC
Δsub91.9 ± 1.9kJ/molVAcree, Tucker, et al., 1991ALS
Δsub77.5 ± 3.7kJ/molCAcree, Tucker, et al., 1991AC
Δsub91.9 ± 1.9kJ/molCAcree, Tucker, et al., 1991AC

Enthalpy of sublimation

ΔsubH (kJ/mol) Temperature (K) Method Reference Comment
87.5 ± 0.5314.CAcree, Sevruk, et al., 1993AC
84.7 ± 1.8319.MEAcree, Simirsky, et al., 1992AC

Gas phase ion energetics data

Data compiled by: Sharon G. Lias, Rhoda D. Levin, and Sherif A. Kafafi

Ionization energy determinations

IE (eV) Method Reference Comment
7.95PEHouk, Caramella, et al., 1977Vertical value

References

Acree, Tucker, et al., 1991
Acree, W.E., Jr.; Tucker, S.A.; Zvaigzne, A.I.; Meng-Yan, Y.; Pilcher, G.; Ribeiro Da Silva, M.D.M., Enthalpies of combustion of 2,4,6-trimethylbenzonitrile, 2,4,6-trimethylbenzonitrile N-oxide,, 2,6-dimethylbenzonitrile, 2,4,6-trimethoxybenzonitrile, and 2,4,6-trimethoxybenzonitrile N-oxide: the dissociation enthalpies of the (N-O) bonds, J. Chem. Thermodyn., 1991, 23, 31-36. [all data]

Acree, Sevruk, et al., 1993
Acree, W.E., Jr.; Sevruk, V.M.; Kozyro, A.A.; Krasulin, A.P.; Kabo, G.J.; Frenkel, M.L., Thermodynamic properties of organic compounds. 3. Sublimation enthalpy and heat capacities of 2,4,6-trimethylbenzonitrile N-oxide, J. Chem. Eng. Data, 1993, 38(1), 101-104. [all data]

Acree, Simirsky, et al., 1992
Acree, W.E., Jr.; Simirsky, V.V.; Kozyro, A.A.; Krasulin, A.P.; Kabo, G.J.; Frenkel, M.L., Thermodynamic properties of organic compounds. 2. Combustion and sublimation enthalpies of 2,4,6-trimethylbenzonitrile N-oxide, J. Chem. Eng. Data, 1992, 37, 131-133. [all data]

Houk, Caramella, et al., 1977
Houk, K.N.; Caramella, P.; Munchausen, L.L.; Chang, Y.-M.; Battaglia, A.; Sims, J.; Kaufman, D.C., Photoelectron spectra of nitrones and nitrile oxides, J. Electron Spectrosc. Relat. Phenom., 1977, 10, 441. [all data]