1,3-Diazine
- Formula: C4H4N2
- Molecular weight: 80.0880
- IUPAC Standard InChIKey: CZPWVGJYEJSRLH-UHFFFAOYSA-N
- CAS Registry Number: 289-95-2
- Chemical structure:

Reaction thermochemistry data

Data compiled as indicated in comments:
MS - José A. Martinho Simões
B - John E. Bartmess
RCD - Robert C. Dunbar
Individual Reactions
C10H5CrNO5 (solution) + (solution) = (solution) + (solution)
By formula: C10H5CrNO5 (solution) + CO (solution) = C6CrO6 (solution) + C4H4N2 (solution)
Quantity | Value | Units | Method | Reference | Comment |
---|---|---|---|---|---|
ΔrH° | -61.9 | kJ/mol | KinS | Wovkulich and Atwood, 1980 | solvent: Hexane; The data rely on the enthalpy and entropy of activation for the forward reaction, 106.3 ± 4.6 kJ/mol and 13.0±14.6 J/(mol K) Dennenberg and Darensbourg, 1972, and also on the enthalpy and entropy of activation for the Cr-CO dissociation in Cr(CO)6, 168.2 ± 2.5 kJ/mol and 94.6±6.3 J/(mol K) Graham and Angelici, 1967. The latter data were obtained in decalin; MS |
(cr) + (l) = C10H5NO5W (cr) + (g)
By formula: C6O6W (cr) + C4H4N2 (l) = C10H5NO5W (cr) + CO (g)
Quantity | Value | Units | Method | Reference | Comment |
---|---|---|---|---|---|
ΔrH° | 34.6 | kJ/mol | N/A | Nakashima and Adamson, 1982 | The reaction enthalpy was calculated from the enthalpy of the reaction W(CO)6(solution) + py(solution) = W(CO)5(py)(solution) + CO(solution) in cyclohexane, 27.4 ± 2.9 kJ/mol, together with the enthalpies of solution of W(CO)6(cr), W(CO)5(py)(cr), and py(l), 35.7, 36.4, and 7.9 kJ/mol, respectively Nakashima and Adamson, 1982.; MS |
C4H3N2- + =
By formula: C4H3N2- + H+ = C4H4N2
Quantity | Value | Units | Method | Reference | Comment |
---|---|---|---|---|---|
ΔrH° | 1612. ± 10. | kJ/mol | TDEq | Meot-ner and Kafafi, 1988 | gas phase; Acid: pyrimidine. Anchored to 88MEO scale, not "87 acidity scale; B |
Quantity | Value | Units | Method | Reference | Comment |
ΔrG° | 1576.5 ± 2.9 | kJ/mol | N/A | Wren, Vogelhuber, et al., 2012 | gas phase; B |
ΔrG° | 1577. ± 8.4 | kJ/mol | TDEq | Meot-ner and Kafafi, 1988 | gas phase; Acid: pyrimidine. Anchored to 88MEO scale, not "87 acidity scale; B |
(solution) + (solution) = C10H5NO5W (solution) + (solution)
By formula: C6O6W (solution) + C4H4N2 (solution) = C10H5NO5W (solution) + CO (solution)
Quantity | Value | Units | Method | Reference | Comment |
---|---|---|---|---|---|
ΔrH° | 27.4 ± 2.9 | kJ/mol | PC | Nakashima and Adamson, 1982 | solvent: Cyclohexane; MS |
ΔrH° | 24.9 ± 2.9 | kJ/mol | PC | Nakashima and Adamson, 1982 | solvent: Benzene; MS |
ΔrH° | 18.4 ± 0.4 | kJ/mol | PC | Nakashima and Adamson, 1982 | solvent: Tetrahydrofuran; MS |
C39H68O3P2W (solution) + (solution) = C44H71NO3P2W (solution) + (g)
By formula: C39H68O3P2W (solution) + C4H4N2 (solution) = C44H71NO3P2W (solution) + H2 (g)
Quantity | Value | Units | Method | Reference | Comment |
---|---|---|---|---|---|
ΔrH° | -39.7 ± 2.1 | kJ/mol | RSC | Gonzalez, Zhang, et al., 1988 | solvent: Toluene; MS |
ΔrH° | -41.8 ± 2.1 | kJ/mol | RSC | Gonzalez, Zhang, et al., 1988 | solvent: Tetrahydrofuran; MS |
C14H10CrN2O4 (cr) = 2 (g) + 4 (g) + (cr)
By formula: C14H10CrN2O4 (cr) = 2C4H4N2 (g) + 4CO (g) + Cr (cr)
Quantity | Value | Units | Method | Reference | Comment |
---|---|---|---|---|---|
ΔrH° | >199. | kJ/mol | TD-HFC | Adedeji, Connor, et al., 1978 | The reaction enthalpy is a low limit Adedeji, Connor, et al., 1978.; MS |
C8H6MoO3 (solution) + 3 (solution) = C18H15MoN3O3 (solution) + (solution)
By formula: C8H6MoO3 (solution) + 3C4H4N2 (solution) = C18H15MoN3O3 (solution) + C5H6 (solution)
Quantity | Value | Units | Method | Reference | Comment |
---|---|---|---|---|---|
ΔrH° | -69.9 ± 2.9 | kJ/mol | RSC | Nolan, Hoff, et al., 1985 | solvent: Pyridine; Reaction temperature: 323 K; MS |
+ = C4H4N3O-
By formula: NO- + C4H4N2 = C4H4N3O-
Quantity | Value | Units | Method | Reference | Comment |
---|---|---|---|---|---|
ΔrH° | 69.5 ± 9.6 | kJ/mol | N/A | Le Barbu, Schiedt, et al., 2002 | gas phase; Affinity is difference in EAs of lesser solvated species; B |
C9H9CrN3O3 (solution) + 3 (solution) = C18H15CrN3O3 (solution) + 3 (solution)
By formula: C9H9CrN3O3 (solution) + 3C4H4N2 (solution) = C18H15CrN3O3 (solution) + 3C2H3N (solution)
Quantity | Value | Units | Method | Reference | Comment |
---|---|---|---|---|---|
ΔrH° | -48.1 ± 3.8 | kJ/mol | RSC | Mukerjee, Lang, et al., 1992 | solvent: Tetrahydrofuran; MS |
C7H9Cl2NPd (solution) + (l) = (PdCl2(C5H5N)2) (solution) + (solution)
By formula: C7H9Cl2NPd (solution) + C4H4N2 (l) = (PdCl2(C5H5N)2) (solution) + C2H4 (solution)
Quantity | Value | Units | Method | Reference | Comment |
---|---|---|---|---|---|
ΔrH° | -57.7 ± 1.7 | kJ/mol | RSC | Partenheimer and Durham, 1974 | solvent: Dichloromethane; MS |
C10H5NO5W (cr) + (g) = (g) + (g)
By formula: C10H5NO5W (cr) + CO (g) = C6O6W (g) + C4H4N2 (g)
Quantity | Value | Units | Method | Reference | Comment |
---|---|---|---|---|---|
ΔrH° | 83. ± 10. | kJ/mol | DSC | Daamen, van der Poel, et al., 1979 | Please also see Meester, Vriends, et al., 1976.; MS |
C12H16CrO5 (solution) + (solution) = (solution) + C10H5CrNO5 (solution)
By formula: C12H16CrO5 (solution) + C4H4N2 (solution) = C7H16 (solution) + C10H5CrNO5 (solution)
Quantity | Value | Units | Method | Reference | Comment |
---|---|---|---|---|---|
ΔrH° | -84.1 ± 1.7 | kJ/mol | PAC | Yang, Vaida, et al., 1988 | solvent: Heptane; MS |
C39H66MoO3P3 (solution) + (solution) = C44H71MoNO3P2 (solution)
By formula: C39H66MoO3P3 (solution) + C4H4N2 (solution) = C44H71MoNO3P2 (solution)
Quantity | Value | Units | Method | Reference | Comment |
---|---|---|---|---|---|
ΔrH° | -70.7 ± 2.5 | kJ/mol | RSC | Zhang, Gonzalez, et al., 1991 | solvent: Toluene; MS |
(cr) + 3 (g) = C18H15MoN3O3 (cr) + 3 (g)
By formula: C6MoO6 (cr) + 3C4H4N2 (g) = C18H15MoN3O3 (cr) + 3CO (g)
Quantity | Value | Units | Method | Reference | Comment |
---|---|---|---|---|---|
ΔrH° | -50.4 ± 7.0 | kJ/mol | HFC | Adedeji, Connor, et al., 1978 | MS |
(cr) + 3 (g) = C18H15N3O3W (g) + 3 (g)
By formula: C6O6W (cr) + 3C4H4N2 (g) = C18H15N3O3W (g) + 3CO (g)
Quantity | Value | Units | Method | Reference | Comment |
---|---|---|---|---|---|
ΔrH° | -54.7 ± 8.4 | kJ/mol | HFC | Adedeji, Connor, et al., 1978 | MS |
C10H5CrNO5 (cr) + (g) = (g) + (g)
By formula: C10H5CrNO5 (cr) + CO (g) = C6CrO6 (g) + C4H4N2 (g)
Quantity | Value | Units | Method | Reference | Comment |
---|---|---|---|---|---|
ΔrH° | 75. ± 6. | kJ/mol | DSC | Daamen, van der Poel, et al., 1979 | MS |
C10H5MoNO5 (cr) + (g) = (g) + (g)
By formula: C10H5MoNO5 (cr) + CO (g) = C6MoO6 (g) + C4H4N2 (g)
Quantity | Value | Units | Method | Reference | Comment |
---|---|---|---|---|---|
ΔrH° | 57. ± 3. | kJ/mol | DSC | Daamen, van der Poel, et al., 1979 | MS |
By formula: Fe+ + C4H4N2 = (Fe+ • C4H4N2)
Quantity | Value | Units | Method | Reference | Comment |
---|---|---|---|---|---|
ΔrH° | 199. ± 7.9 | kJ/mol | CIDT | Amunugama and Rodgers, 2001 | RCD |
By formula: Cr+ + C4H4N2 = (Cr+ • C4H4N2)
Quantity | Value | Units | Method | Reference | Comment |
---|---|---|---|---|---|
ΔrH° | 177. ± 6.3 | kJ/mol | CIDT | Amunugama and Rodgers, 2001 | RCD |
By formula: Ti+ + C4H4N2 = (Ti+ • C4H4N2)
Quantity | Value | Units | Method | Reference | Comment |
---|---|---|---|---|---|
ΔrH° | 214. ± 10. | kJ/mol | CIDT | Amunugama and Rodgers, 2001 | RCD |
By formula: Mn+ + C4H4N2 = (Mn+ • C4H4N2)
Quantity | Value | Units | Method | Reference | Comment |
---|---|---|---|---|---|
ΔrH° | 159. ± 9.6 | kJ/mol | CIDT | Amunugama and Rodgers, 2001 | RCD |
By formula: Sc+ + C4H4N2 = (Sc+ • C4H4N2)
Quantity | Value | Units | Method | Reference | Comment |
---|---|---|---|---|---|
ΔrH° | 214. ± 9.2 | kJ/mol | CIDT | Amunugama and Rodgers, 2001 | RCD |
By formula: Mg+ + C4H4N2 = (Mg+ • C4H4N2)
Quantity | Value | Units | Method | Reference | Comment |
---|---|---|---|---|---|
ΔrH° | 174. ± 5.9 | kJ/mol | CIDT | Amunugama and Rodgers, 2001 | RCD |
By formula: V+ + C4H4N2 = (V+ • C4H4N2)
Quantity | Value | Units | Method | Reference | Comment |
---|---|---|---|---|---|
ΔrH° | 204. ± 7.1 | kJ/mol | CIDT | Amunugama and Rodgers, 2001 | RCD |
By formula: Ni+ + C4H4N2 = (Ni+ • C4H4N2)
Quantity | Value | Units | Method | Reference | Comment |
---|---|---|---|---|---|
ΔrH° | 244. ± 9.6 | kJ/mol | CIDT | Amunugama and Rodgers, 2001 | RCD |
By formula: Al+ + C4H4N2 = (Al+ • C4H4N2)
Quantity | Value | Units | Method | Reference | Comment |
---|---|---|---|---|---|
ΔrH° | 159. ± 5.9 | kJ/mol | CIDT | Amunugama and Rodgers, 2001 | RCD |
By formula: Zn+ + C4H4N2 = (Zn+ • C4H4N2)
Quantity | Value | Units | Method | Reference | Comment |
---|---|---|---|---|---|
ΔrH° | 208. ± 7.5 | kJ/mol | CIDT | Amunugama and Rodgers, 2001 | RCD |
By formula: Co+ + C4H4N2 = (Co+ • C4H4N2)
Quantity | Value | Units | Method | Reference | Comment |
---|---|---|---|---|---|
ΔrH° | 245. ± 13. | kJ/mol | CIDT | Amunugama and Rodgers, 2001 | RCD |
By formula: Cu+ + C4H4N2 = (Cu+ • C4H4N2)
Quantity | Value | Units | Method | Reference | Comment |
---|---|---|---|---|---|
ΔrH° | 249. ± 9.6 | kJ/mol | CIDT | Amunugama and Rodgers, 2001 | RCD |

Ion clustering data

Data compiled as indicated in comments:
RCD - Robert C. Dunbar
B - John E. Bartmess
Clustering reactions
By formula: Al+ + C4H4N2 = (Al+ • C4H4N2)
Quantity | Value | Units | Method | Reference | Comment |
---|---|---|---|---|---|
ΔrH° | 159. ± 5.9 | kJ/mol | CIDT | Amunugama and Rodgers, 2001 | RCD |
By formula: Co+ + C4H4N2 = (Co+ • C4H4N2)
Quantity | Value | Units | Method | Reference | Comment |
---|---|---|---|---|---|
ΔrH° | 245. ± 13. | kJ/mol | CIDT | Amunugama and Rodgers, 2001 | RCD |
By formula: Cr+ + C4H4N2 = (Cr+ • C4H4N2)
Quantity | Value | Units | Method | Reference | Comment |
---|---|---|---|---|---|
ΔrH° | 177. ± 6.3 | kJ/mol | CIDT | Amunugama and Rodgers, 2001 | RCD |
By formula: Cu+ + C4H4N2 = (Cu+ • C4H4N2)
Quantity | Value | Units | Method | Reference | Comment |
---|---|---|---|---|---|
ΔrH° | 249. ± 9.6 | kJ/mol | CIDT | Amunugama and Rodgers, 2001 | RCD |
By formula: Fe+ + C4H4N2 = (Fe+ • C4H4N2)
Quantity | Value | Units | Method | Reference | Comment |
---|---|---|---|---|---|
ΔrH° | 199. ± 7.9 | kJ/mol | CIDT | Amunugama and Rodgers, 2001 | RCD |
By formula: Mg+ + C4H4N2 = (Mg+ • C4H4N2)
Quantity | Value | Units | Method | Reference | Comment |
---|---|---|---|---|---|
ΔrH° | 174. ± 5.9 | kJ/mol | CIDT | Amunugama and Rodgers, 2001 | RCD |
By formula: Mn+ + C4H4N2 = (Mn+ • C4H4N2)
Quantity | Value | Units | Method | Reference | Comment |
---|---|---|---|---|---|
ΔrH° | 159. ± 9.6 | kJ/mol | CIDT | Amunugama and Rodgers, 2001 | RCD |
+ = C4H4N3O-
By formula: NO- + C4H4N2 = C4H4N3O-
Quantity | Value | Units | Method | Reference | Comment |
---|---|---|---|---|---|
ΔrH° | 69.5 ± 9.6 | kJ/mol | N/A | Le Barbu, Schiedt, et al., 2002 | gas phase; Affinity is difference in EAs of lesser solvated species; B |
By formula: Ni+ + C4H4N2 = (Ni+ • C4H4N2)
Quantity | Value | Units | Method | Reference | Comment |
---|---|---|---|---|---|
ΔrH° | 244. ± 9.6 | kJ/mol | CIDT | Amunugama and Rodgers, 2001 | RCD |
By formula: Sc+ + C4H4N2 = (Sc+ • C4H4N2)
Quantity | Value | Units | Method | Reference | Comment |
---|---|---|---|---|---|
ΔrH° | 214. ± 9.2 | kJ/mol | CIDT | Amunugama and Rodgers, 2001 | RCD |
By formula: Ti+ + C4H4N2 = (Ti+ • C4H4N2)
Quantity | Value | Units | Method | Reference | Comment |
---|---|---|---|---|---|
ΔrH° | 214. ± 10. | kJ/mol | CIDT | Amunugama and Rodgers, 2001 | RCD |
By formula: V+ + C4H4N2 = (V+ • C4H4N2)
Quantity | Value | Units | Method | Reference | Comment |
---|---|---|---|---|---|
ΔrH° | 204. ± 7.1 | kJ/mol | CIDT | Amunugama and Rodgers, 2001 | RCD |
By formula: Zn+ + C4H4N2 = (Zn+ • C4H4N2)
Quantity | Value | Units | Method | Reference | Comment |
---|---|---|---|---|---|
ΔrH° | 208. ± 7.5 | kJ/mol | CIDT | Amunugama and Rodgers, 2001 | RCD |

Gas phase thermochemistry data

Data compiled by: Hussein Y. Afeefy, Joel F. Liebman, and Stephen E. Stein
Quantity | Value | Units | Method | Reference | Comment |
---|---|---|---|---|---|
ΔfH°gas | 195.8 ± 1.5 | kJ/mol | Ccr | Nabavian, Sabbah, et al., 1977 | Reanalyzed by Pedley, Naylor, et al., 1986, Original value = 193.1 ± 2.0 kJ/mol |
ΔfH°gas | 195.9 ± 1.4 | kJ/mol | Ccb | Tjebbes, 1962 | Reanalyzed by Cox and Pilcher, 1970, Original value = 196.6 ± 1.0 kJ/mol |

Condensed phase thermochemistry data

Data compiled by: Hussein Y. Afeefy, Joel F. Liebman, and Stephen E. Stein
Quantity | Value | Units | Method | Reference | Comment |
---|---|---|---|---|---|
ΔfH°liquid | 143.2 ± 1.8 | kJ/mol | Ccr | Nabavian, Sabbah, et al., 1977 | |
ΔfH°liquid | 146.6 ± 0.84 | kJ/mol | Ccb | Tjebbes, 1962 | |
Quantity | Value | Units | Method | Reference | Comment |
ΔcH°liquid | -2288.9 ± 1.8 | kJ/mol | Ccr | Nabavian, Sabbah, et al., 1977 | |
ΔcH°liquid | -2292.3 ± 0.84 | kJ/mol | Ccb | Tjebbes, 1962 |

Phase change data

Data compiled as indicated in comments:
BS - Robert L. Brown and Stephen E. Stein
AC - William E. Acree, Jr., James S. Chickos
ALS - Hussein Y. Afeefy, Joel F. Liebman, and Stephen E. Stein
DRB - Donald R. Burgess, Jr.
Quantity | Value | Units | Method | Reference | Comment |
---|---|---|---|---|---|
Tboil | 396.7 | K | N/A | Weast and Grasselli, 1989 | BS |
Quantity | Value | Units | Method | Reference | Comment |
ΔvapH° | 49. ± 7. | kJ/mol | AVG | N/A | Average of 7 values; Individual data points |

Gas phase ion energetics data

Data evaluated as indicated in comments:
HL - Edward P. Hunter and Sharon G. Lias
L - Sharon G. Lias
Data compiled as indicated in comments:
B - John E. Bartmess
LBLHLM - Sharon G. Lias, John E. Bartmess, Joel F. Liebman, John L. Holmes, Rhoda D. Levin, and W. Gary Mallard
LLK - Sharon G. Lias, Rhoda D. Levin, and Sherif A. Kafafi
RDSH - Henry M. Rosenstock, Keith Draxl, Bruce W. Steiner, and John T. Herron
Quantity | Value | Units | Method | Reference | Comment |
---|---|---|---|---|---|
IE (evaluated) | 9.33 ± 0.07 | eV | N/A | N/A | L |
Quantity | Value | Units | Method | Reference | Comment |
Proton affinity (review) | 885.8 | kJ/mol | N/A | Hunter and Lias, 1998 | HL |
Quantity | Value | Units | Method | Reference | Comment |
Gas basicity | 855.7 | kJ/mol | N/A | Hunter and Lias, 1998 | HL |
Electron affinity determinations
EA (eV) | Method | Reference | Comment |
---|---|---|---|
>-0.24999 | ETS | Nenner and Schultz, 1975 | Pyrimidine. EA estimated as 0 eV, based on soln phase electrochemical correlations. G3MP2B3 calculations put EA at -4 kcal/mol; B |
Ionization energy determinations
IE (eV) | Method | Reference | Comment |
---|---|---|---|
9.1 | PE | Piancastelli, Keller, et al., 1983 | LBLHLM |
9.23 | PE | Gleiter, Heilbronner, et al., 1972 | LLK |
9.32 ± 0.01 | PE | Asbrink, Fridh, et al., 1972 | LLK |
9.42 | PE | Dewar and Worley, 1969 | RDSH |
9.35 ± 0.01 | PI | Yencha and El-Sayed, 1968 | RDSH |
9.73 ± 0.03 | PE | Hush and Cheung, 1975 | Vertical value; LLK |
9.73 | PE | Suffolk, 1974 | Vertical value; LLK |
9.73 | PE | Gleiter, Heilbronner, et al., 1970 | Vertical value; RDSH |
Appearance energy determinations
Ion | AE (eV) | Other Products | Method | Reference | Comment |
---|---|---|---|---|---|
C3H2N+ | 15.01 ± 0.10 | ? | EI | Momigny, Urbain, et al., 1965 | RDSH |
C3H3N+ | 12.87 ± 0.10 | HCN | EI | Momigny, Urbain, et al., 1965 | RDSH |
C4H3N2+ | 13.01 ± 0.10 | H | EI | Momigny, Urbain, et al., 1965 | RDSH |
De-protonation reactions
C4H3N2- + =
By formula: C4H3N2- + H+ = C4H4N2
Quantity | Value | Units | Method | Reference | Comment |
---|---|---|---|---|---|
ΔrH° | 1612. ± 10. | kJ/mol | TDEq | Meot-ner and Kafafi, 1988 | gas phase; Acid: pyrimidine. Anchored to 88MEO scale, not "87 acidity scale; B |
Quantity | Value | Units | Method | Reference | Comment |
ΔrG° | 1576.5 ± 2.9 | kJ/mol | N/A | Wren, Vogelhuber, et al., 2012 | gas phase; B |
ΔrG° | 1577. ± 8.4 | kJ/mol | TDEq | Meot-ner and Kafafi, 1988 | gas phase; Acid: pyrimidine. Anchored to 88MEO scale, not "87 acidity scale; B |

Kovats' RI, non-polar column, isothermal

View large format table.

Column type Active phase Temperature (C) I Reference Comment
CapillaryOV-101110.744.Golovnya, Kuz'menko, et al., 2000He; Phase thickness: 0.4 μm
CapillaryOV-101110.744.Zhuravleva, 200050. m/0.3 mm/0.4 μm, He
CapillaryOV-101110.744.Golovnya, Kuz'menko, et al., 199950. m/0.3 mm/0.4 μm, He

Kovats' RI, non-polar column, custom temperature program

View large format table.

Column type Active phase I Reference Comment
PackedOV-1702.Yamaji, Kimura, et al., 1978Gas Chrom Q; Column length: 1. m; Program: not specified

Kovats' RI, polar column, isothermal

View large format table.

Column type Active phase Temperature (C) I Reference Comment
PackedPEG-2000150.1303.Anderson, Jurel, et al., 1973He, Celite 545 (44-60 mesh); Column length: 3. m
PackedPEG-2000180.1308.Anderson, Jurel, et al., 1973He, Celite 545 (44-60 mesh); Column length: 3. m
PackedPEG-2000200.1318.Anderson, Jurel, et al., 1973He, Celite 545 (44-60 mesh); Column length: 3. m

Van Den Dool and Kratz RI, non-polar column, temperature ramp

View large format table.

Column type Active phase I Reference Comment
CapillaryOV-1718.4Gautzsch and Zinn, 19968. K/min; Tstart: 35. C; Tend: 300. C
PackedSE-30728.Peng, Ding, et al., 1988He, Supelcoport and Chromosorb, 40. C @ 4. min, 10. K/min, 250. C @ 60. min; Column length: 3.05 m

Normal alkane RI, polar column, custom temperature program

View large format table.

Column type Active phase I Reference Comment
CapillaryDB-Wax1257.Peng, Yang, et al., 1991Program: not specified
CapillaryDB-Wax1276.Peng, Yang, et al., 1991Program: not specified

References

Wovkulich and Atwood, 1980
Wovkulich, M.J.; Atwood, J.D.,
J. Organometal. Chem., 1980, 184, 77. [all data]
Dennenberg and Darensbourg, 1972
Dennenberg, R.J.; Darensbourg, D.J.,
Inorg. Chem., 1972, 11, 72. [all data]
Graham and Angelici, 1967
Graham, J.R.; Angelici, R.J.,
Inorg. Chem., 1967, 6, 2082. [all data]
Nakashima and Adamson, 1982
Nakashima, M.; Adamson, A.W.,
J. Phys. Chem., 1982, 86, 2905. [all data]
Meot-ner and Kafafi, 1988
Meot-ner, M.; Kafafi, S.A.,
Carbon Acidities of Aromatic Compounds,
J. Am. Chem. Soc., 1988, 110, 19, 6297, https://doi.org/10.1021/ja00227a003
. [all data]
Wren, Vogelhuber, et al., 2012
Wren, S.W.; Vogelhuber, K.M.; Garver, J.M.; Kato, S.; Sheps, L.; Bierbaum, V.M.; Lineberger, W.C.,
C-H Bond Strengths and Acidities in Aromatic Systems: Effects of Nitrogen Incorporation in Mono-, Di-, and Triazines,
J. Am. Chem. Soc., 2012, 134, 15, 6584-6595, https://doi.org/10.1021/ja209566q
. [all data]
Gonzalez, Zhang, et al., 1988
Gonzalez, A.A.; Zhang, K.; Nolan, S.P.; Lopez de la Vega, R.; Mukerjee, S.L.; Hoff, C.D.,
Organometallics, 1988, 7, 2429. [all data]
Adedeji, Connor, et al., 1978
Adedeji, F.A.; Connor, J.A.; Demain, C.P.; Martinho Simões, J.A.; Skinner, H.A.; Zafarani- Moattar, M.T.,
J. Organometal. Chem., 1978, 149, 333. [all data]
Nolan, Hoff, et al., 1985
Nolan, S.P.; Hoff, C.D.; Landrum, J.T.,
J. Organometal. Chem., 1985, 282, 357. [all data]
Le Barbu, Schiedt, et al., 2002
Le Barbu, K.; Schiedt, J.; Weinkauf, R.; Schlag, E.W.; Nilles, J.M.; Xu, S.J.; Thomas, O.C.; Bowen, K.H.,
Microsolvation of small anions by aromatic molecules: An exploratory study,
J. Chem. Phys., 2002, 116, 22, 9663-9671, https://doi.org/10.1063/1.1475750
. [all data]
Mukerjee, Lang, et al., 1992
Mukerjee, S.L.; Lang, R.F.; Ju, T.; Kiss, G.; Hoff, C.D.; Nolan, S.P.,
Inorg. Chem., 1992, 31, 4885. [all data]
Partenheimer and Durham, 1974
Partenheimer, W.; Durham, B.,
J. Am. Chem. Soc., 1974, 96, 3800. [all data]
Daamen, van der Poel, et al., 1979
Daamen, H.; van der Poel, H.; Stufkens, D.J.; Oskam, A.,
Thermochim. Acta, 1979, 34, 69. [all data]
Meester, Vriends, et al., 1976
Meester, M.A.M.; Vriends, R.C.J.; Stufkens, D.J.; Vrieze, K.,
Inorg. Chim. Acta, 1976, 19, 95. [all data]
Yang, Vaida, et al., 1988
Yang, G.K.; Vaida, V.; Peters, K.S.,
Polyhedron, 1988, 7, 1619. [all data]
Zhang, Gonzalez, et al., 1991
Zhang, K.; Gonzalez, A.A.; Murkerjee, S.L.; Chou, S.-J.; Hoff, C.D.; Kubat- Martin, K.A.; Barnhart, D.; Kubas, G.J.,
J. Am. Chem. Soc., 1991, 113, 9170. [all data]
Amunugama and Rodgers, 2001
Amunugama, R.; Rodgers, M.T.,
Periodic Trends in the Binding of Metal Ions to Pyrimidine Studied by Threshold Collision-Induced Dissociation and Density Functional Theory,
J. Phys. Chem. A, 2001, 105, 43, 9883, https://doi.org/10.1021/jp010663i
. [all data]