cis-β-Farnesene

Van Den Dool and Kratz RI, non-polar column, temperature ramp

Data compiled by: NIST Mass Spectrometry Data Center, William E. Wallace, director

Column type CapillaryCapillaryCapillaryCapillaryCapillary
Active phase Equity-5MSDB-5DB-5DB-5HP-5MS
Column length (m) 30.30.25.30.30.
Carrier gas He HeHeHe
Substrate
Column diameter (mm) 0.250.220.250.250.25
Phase thickness (μm) 0.250.250.250.250.25
Tstart (C) 50.60.60.60.60.
Tend (C) 250.240.200.260.280.
Heat rate (K/min) 3.3.2.5.4.
Initial hold (min)  2.  5.
Final hold (min) 10. 60.
I 1452.1449.1440.1458.1442.
ReferenceBelsito E.L., Carbone C., et al., 2007Martins, Santos, et al., 2007Rout, Rao, et al., 2007Sabulal, Dan, et al., 2007Saroglou, Marin, et al., 2007
Comment MSDC-RI MSDC-RI MSDC-RI MSDC-RI MSDC-RI
Column type CapillaryCapillaryCapillaryCapillaryCapillary
Active phase DB-5DB-1HP-5MSHP-5MSHP-5MS
Column length (m) 30.60.30.30.30.
Carrier gas HeN2HeHeHe
Substrate
Column diameter (mm) 0.220.250.250.250.25
Phase thickness (μm) 0.250.250.250.250.25
Tstart (C) 55.60.80.60.60.
Tend (C) 240.250.300.280.280.
Heat rate (K/min) 3.5.4.3.4.
Initial hold (min) 2.   5.
Final hold (min) 15.10.
I 1438.1449.1457.1439.1445.
ReferenceSilva, Barbosa, et al., 2007Sonboli, Azizian, et al., 2007Zeng, Zhao, et al., 2007Aligiannis, Kalpoutzakis, et al., 2004Grujic-Jovanovic, Skaltsa, et al., 2004
Comment MSDC-RI MSDC-RI MSDC-RI MSDC-RI MSDC-RI
Column type CapillaryCapillaryCapillaryCapillaryCapillary
Active phase DB-5MSHP-5DB-1PE-5DB-5
Column length (m) 30.50.30.30.30.
Carrier gas HeHeHeHeN2
Substrate
Column diameter (mm) 0.250.20.250.250.25
Phase thickness (μm) 0.250.20.25 0.25
Tstart (C) 40.40.40.40.75.
Tend (C) 280.250.250.280.230.
Heat rate (K/min) 4.3.2.3.3.
Initial hold (min) 2.15.5. 10.
Final hold (min)  40.20.
I 1460.1442.1442.1445.1451.
ReferenceMardarowicz, Wianowska, et al., 2004Stashenko, Jaramillo, et al., 2004de Feo, Bruno, et al., 2003Isidorov and Vinogorova, 2003bin Jantan, Yassin, et al., 2003
Comment MSDC-RI MSDC-RI MSDC-RI MSDC-RI MSDC-RI
Column type CapillaryCapillaryCapillaryCapillaryCapillary
Active phase HP-1HP-5Mega 5MSDB-5RTX-5
Column length (m) 30.30.30.25.30.
Carrier gas HeHeHeHeHe
Substrate
Column diameter (mm) 0.250.250.250.250.25
Phase thickness (μm) 0.330.250.25 0.25
Tstart (C) 40.60.40.70.45.
Tend (C) 260.280.240.275.300.
Heat rate (K/min) 2.4.3.4.3.
Initial hold (min) 5.5.2. 6.
Final hold (min) 20.   10.
I 1455.1448.1452.1443.1446.
ReferenceSenatore, Rigano, et al., 2003Skaltsa, Demetzos, et al., 2003Verzera, Trozzi, et al., 2003Javidnia, Miri, et al., 2002Mondello, Zappia, et al., 2002
Comment MSDC-RI MSDC-RI MSDC-RI MSDC-RI MSDC-RI
Column type CapillaryCapillaryCapillaryCapillaryCapillary
Active phase HP-5MSHP-5Petrocol DHDB-5SE-30
Column length (m) 30.30.100.30.25.
Carrier gas HeHeHeHeN2
Substrate
Column diameter (mm) 0.250.250.250.250.20
Phase thickness (μm) 0.250.250.50.25
Tstart (C) 50.60.60.60.60.
Tend (C) 250.280.180.300.180.
Heat rate (K/min) 5.3.4.5.3.
Initial hold (min) 2.5.8.3.10.
Final hold (min) 5. 2. 1.
I 1428.1440.1443.1446.1451.
ReferenceShang, Hu, et al., 2002Aligiannis, Kalpoutzakis, et al., 2001Alonzo, Saiano, et al., 2001Bortolomeazzi, Berno, et al., 2001bin Jantan, Basni, et al., 2001
Comment MSDC-RI MSDC-RI MSDC-RI MSDC-RI MSDC-RI
Column type CapillaryCapillaryCapillaryCapillaryCapillary
Active phase DB-5DB-5OV-101Mega 5MSHP-5
Column length (m) 60.30.25.30.30.
Carrier gas HeHeN2HeHe
Substrate
Column diameter (mm) 0.250.250.250.250.25
Phase thickness (μm) 0.250.25 0.250.25
Tstart (C) 40.60.50.40.50.
Tend (C) 290.300.200.240.280.
Heat rate (K/min) 4.5.5.3.4.
Initial hold (min) 2.3. 2.5.
Final hold (min) 5.
I 1443.1446.1447.1452.1439.
ReferenceBartley and Jacobs, 2000Bortolomeazzi, Pizzale, et al., 2000Menut, Bessiere, et al., 2000Verzera, la Rosa, et al., 2000Lazari, Skaltsa, et al., 1999
Comment MSDC-RI MSDC-RI MSDC-RI MSDC-RI MSDC-RI
Column type Capillary
Active phase DB-1
Column length (m) 60.
Carrier gas He
Substrate
Column diameter (mm) 0.25
Phase thickness (μm) 0.25
Tstart (C) 50.
Tend (C) 220.
Heat rate (K/min) 4.
Initial hold (min)
Final hold (min)
I 1451.
ReferenceMirza and Sefidkon, 1999
Comment MSDC-RI

Normal alkane RI, non-polar column, custom temperature program

Data compiled by: NIST Mass Spectrometry Data Center, William E. Wallace, director

Column type CapillaryCapillaryCapillaryCapillaryCapillary
Active phase 5 % Phenyl polydimethyl siloxaneDB-5DB-1DB-5CP Sil 8 CB
Column length (m)  30.30.30.30.
Carrier gas  HeliumHeliumHelium
Substrate
Column diameter (mm)  0.200.250.250.25
Phase thickness (μm)  0.320.250.250.25
Program not specified60 0C (1 min) 3 0C/min -> 140 0C 50 0C/min -> 250 0C (3 min)not specified50 0C m6 0C/min -> 140 0C 5 0C/min -> 160 0C (1 min) 10 0C/min -> 200 0C60C => 2.5C/min => 170C => 10C/min => 250C (5min)
I 1442.1443.1458.1451.1443.
ReferenceChaverri, Diaz, et al., 2011Nezhadali and Parsa, 2010Xu, Tang, et al., 2010Courtois, Paine, et al., 2009Kristiawan, Sobolik, et al., 2008
Comment MSDC-RI MSDC-RI MSDC-RI MSDC-RI MSDC-RI
Column type CapillaryCapillaryCapillaryCapillaryCapillary
Active phase DB-5HP-5 MSCP Sil 8 CBSE-52DB-5MS
Column length (m) 50.30.50.30.30.
Carrier gas HeliumHeliumHeHe
Substrate
Column diameter (mm) 0.320.250.320.320.25
Phase thickness (μm) 0.25 0.250.150.25
Program 60 0C (1 min) 5 0C/min -> 160 0C 10 0C/min -> 250 0C40 0C (10 min) 3 oC/min -> 200 0C 2 0C/min -> 220 0C60C(2min) => 5C/min => 160C(1min) => 10C/min => 250C (5min)45C => 1C/min => 100C => 5C/min => 250C (10min)70C(2min) => 10C/min => 150C(15min) => 5C/min => 240C
I 1443.1440.1443.1443.1438.
ReferenceNivinsliene, Butkiene, et al., 2007Setzer, Stokes, et al., 2007Judzentiene and Buzelyte, 2006Tognolini, Barocelli, et al., 2006Bagci and Baser, 2005
Comment MSDC-RI MSDC-RI MSDC-RI MSDC-RI MSDC-RI
Column type CapillaryCapillaryCapillaryCapillaryCapillary
Active phase HP-5MSSE-30DB-5HP-5 MSDB-1
Column length (m) 30. 30.30.30.
Carrier gas   HeHeliumHe
Substrate
Column diameter (mm) 0.25 0.250.250.25
Phase thickness (μm) 0.25 0.10.250.25
Program 40C(5min) => 3C/min => 90C => 10C/min => 280Cnot specified35C => 4C/min => 180C => 20C/min => 280Cnot specified45C => 3C/min => 175C => 15C/min => 240C (10min)
I 1447.1442.1443.1426.1476.
ReferenceNovak, Draxler, et al., 2005Vinogradov, 2004Viana, Andrade-Neto, et al., 2002Shang, Hu, et al., 2001Baratta, Dorman, et al., 1998
Comment MSDC-RI MSDC-RI MSDC-RI MSDC-RI MSDC-RI
Column type Capillary
Active phase Methyl Silicone
Column length (m)
Carrier gas
Substrate
Column diameter (mm)
Phase thickness (μm)
Program not specified
I 1442.
ReferenceZenkevich, 1996
Comment MSDC-RI

References

Belsito E.L., Carbone C., et al., 2007
Belsito E.L.; Carbone C.; Di Gioia M.L.; Leggio A.; Liguoiri A.; Perri F.; Siciliano C.; Viscomi M.C., Comparison of the volatile constituents in cold-pressed bergamot oil and a volatile oil isolated by vacuum distillation, J. Agric. Food Chem., 2007, 55, 19, 7847-7851, https://doi.org/10.1021/jf070997q . [all data]

Martins, Santos, et al., 2007
Martins, F.T.; Santos, M.H.; Polo, M.; Barbosa, L.C.A., Effects of the interactions among macronutrients, plant age and photoperiod in the composition of Hyptis suaveolens (L.) Poit essential oil from Alfenas (MG), Brazil, Flavour Fragr. J., 2007, 22, 2, 123-129, https://doi.org/10.1002/ffj.1769 . [all data]

Rout, Rao, et al., 2007
Rout, P.K.; Rao, Y.R.; Sree., A.; Naik, S.N., Composition of essential oil, concrete, absolute, wax and headspace volatiles of Murrarya paniculata (Linn.) Jack flowers, Flavour Fragr. J., 2007, 22, 5, 352-357, https://doi.org/10.1002/ffj.1804 . [all data]

Sabulal, Dan, et al., 2007
Sabulal, B.; Dan, M.; John, A.; Kurup, R.; Chandrika, S.P.; George, V., Phenylbutanoid-rich rhizome oil of Zingiber neesanum from Western Ghats, southern India, Flavour Fragr. J., 2007, 22, 6, 521-524, https://doi.org/10.1002/ffj.1834 . [all data]

Saroglou, Marin, et al., 2007
Saroglou, V.; Marin, P.D.; Rancic, A.; Veljic, M.; Skaltsa, H., Composition and antimicrobial activity of the essential oil of six Hypericum species from Serbia, Biochem. Syst. Ecol., 2007, 35, 3, 146-152, https://doi.org/10.1016/j.bse.2006.09.009 . [all data]

Silva, Barbosa, et al., 2007
Silva, C.J.; Barbosa, L.C.A.; Maltha, C.R.A.; Pinheiro, A.L.; Ismail, F.M.D., Comparative study of the essential oils of seven Melaleuca (Myrtaceae) species grown in Brazil, Flavour Fragr. J., 2007, 22, 6, 474-478, https://doi.org/10.1002/ffj.1823 . [all data]

Sonboli, Azizian, et al., 2007
Sonboli, A.; Azizian, D.; Yousefzadi, M.; Kanani, M.R.; Mehrabian, A.R., Volatile constituents and antimicrobial activity of the essential oil of Tetrataenium lasiopetalum (Apiaceae) from Iran, Flavour Fragr. J., 2007, 22, 2, 119-122, https://doi.org/10.1002/ffj.1767 . [all data]

Zeng, Zhao, et al., 2007
Zeng, Y.-X.; Zhao, C.-X.; Liang, Y.-Z.; Yang, H.; Fang, H.-Z.; Yi, L.-Z.; Zeng, Z.-D., Comparative analysis of volatile components from Clematis species growing in China, Anal. Chim. Acta., 2007, 595, 1-2, 328-339, https://doi.org/10.1016/j.aca.2006.12.022 . [all data]

Aligiannis, Kalpoutzakis, et al., 2004
Aligiannis, N.; Kalpoutzakis, E.; Kyriakopoulou, I.; Mitaku, S.; Chinou, I.B., Essential oils of Phlomis species growing in Greece: chemical composition and antimicrobial activity, Flavour Fragr. J., 2004, 19, 4, 320-324, https://doi.org/10.1002/ffj.1305 . [all data]

Grujic-Jovanovic, Skaltsa, et al., 2004
Grujic-Jovanovic, S.; Skaltsa, H.D.; Marin, P.; Sokovic, M., Composition and antibacterial activity of the essential oil of six Stachys species from Serbia, Flavour Fragr. J., 2004, 19, 2, 139-144, https://doi.org/10.1002/ffj.1275 . [all data]

Mardarowicz, Wianowska, et al., 2004
Mardarowicz, M.; Wianowska, D.; Dawidowicz, A.L.; Sawicki, R., The influence of sample treatment on SPME extracts from conifers. I. Comparison of terpene composition in Engelmann Spruce (Picea engelmanii) using hydrodistillation, SPME and PLE, Annales Universitatis Mariae Curie-Sklodowska Lublin - Polonia, 2004, 59, 3, 25-42. [all data]

Stashenko, Jaramillo, et al., 2004
Stashenko, E.E.; Jaramillo, B.E.; Martínez, J.R., Analysis of volatile secondary metabolites from Colombian Xylopia aromatica (Lamarck) by different extraction and headspace methods and gas chromatography, J. Chromatogr. A, 2004, 1025, 1, 105-113, https://doi.org/10.1016/j.chroma.2003.10.059 . [all data]

de Feo, Bruno, et al., 2003
de Feo, V.; Bruno, M.; Tahiri, B.; Napolitano, F.; Senatore, F., Chemical composition and antibacterial activity of essential oils from Thymus spinulosus Ten. (Lamiaceae), J. Agric. Food Chem., 2003, 51, 13, 3849-3853, https://doi.org/10.1021/jf021232f . [all data]

Isidorov and Vinogorova, 2003
Isidorov, V.A.; Vinogorova, V.T., GC-MS analysis of compounds extracted from buds of Populus balsamifera and Populus nigra, Z. Naturforsch. C:, 2003, 58, 355-360. [all data]

bin Jantan, Yassin, et al., 2003
bin Jantan, I.; Yassin, M.S.M.; Chin, C.B.; Chen, L.L.; Sim. N.L., Antifungal activity of the essential oils of nine Zingiberaceae species, Pharm. Biol., 2003, 41, 5, 392-397, https://doi.org/10.1076/phbi.41.5.392.15941 . [all data]

Senatore, Rigano, et al., 2003
Senatore, F.; Rigano, D.; de Fusco, R.; Bruno, M., Volatile components of Centaurea cineraria L. subsp. umbrosa (lacaita) Pign. and Centaurea napifolia L. (Asteraceae), two species growing wild in Sicily, Flavour Fragr. J., 2003, 18, 3, 248-251, https://doi.org/10.1002/ffj.1179 . [all data]

Skaltsa, Demetzos, et al., 2003
Skaltsa, H.D.; Demetzos, C.; Lazari, D.; Sokovic, M., Essential oil analysis and antimicrobial activity of eight Stachys species from Greece, Phytochemistry, 2003, 64, 3, 743-752, https://doi.org/10.1016/S0031-9422(03)00386-8 . [all data]

Verzera, Trozzi, et al., 2003
Verzera, A.; Trozzi, A.; Gazea, F.; Cicciarelloi, G.; Cotroneo, A., Effects of rootstock on the composition of bergamot (Citrus bergamia Risso et Poiteau) essential oil, J. Agric. Food Chem., 2003, 51, 1, 206-210, https://doi.org/10.1021/jf0206872 . [all data]

Javidnia, Miri, et al., 2002
Javidnia, K.; Miri, R.; Safavi, F.; Azarpira, A.; Shafiee, A., Composition of the essential oil of Nepeta persica Boiss from Iran, Flavour Fragr. J., 2002, 17, 1, 20-22, https://doi.org/10.1002/ffj.1023 . [all data]

Mondello, Zappia, et al., 2002
Mondello, L.; Zappia, G.; Cotroneo, A.; Bonaccorsi, I.; Chowdhury, J.U.; Yusuf, M.; Dugo, G., Studies on the essential oil-bearing plants of Bangladesh. Part VIII. Composition of some Ocimum oils O. basilicum L. var. purpurascens; O. sanctum L. green; O. sanctum L. purple; O. americanum L., citral type; O. americanum L., camphor type, Flavour Fragr. J., 2002, 17, 5, 335-340, https://doi.org/10.1002/ffj.1108 . [all data]

Shang, Hu, et al., 2002
Shang, C.; Hu, Y.; Deng, C.; Hu, K., Rapid determination of volatile constituents of Michelia alba flowers by gas chromatography-mass spectrometry with solid-phase microextraction, J. Chromatogr. A, 2002, 942, 1-2, 283-288, https://doi.org/10.1016/S0021-9673(01)01382-6 . [all data]

Aligiannis, Kalpoutzakis, et al., 2001
Aligiannis, N.; Kalpoutzakis, E.; Chinou, I.B.; Mitaku, S.; Gikas, E.; Tsarbopoulos, A., Composition and antimicrobial activity of the essential oils of five taxa of Sideritis from Greece, J. Agric. Food Chem., 2001, 49, 2, 811-815, https://doi.org/10.1021/jf001018w . [all data]

Alonzo, Saiano, et al., 2001
Alonzo, G.; Saiano, F.; Tusa, N.; del Bosco, S.F., Analysis of volatile compounds released from embryogenic cultures and somatic embryos of sweet oranges by head space SPME, Plant Cell Tissue Organ Cult., 2001, 66, 1, 31-34, https://doi.org/10.1023/A:1010608417457 . [all data]

Bortolomeazzi, Berno, et al., 2001
Bortolomeazzi, R.; Berno, P.; Pizzale, L.; Conte, L.S., Sesquiterpene, alkene, and alkane hydrocarbons in virgin olive oils of different varieties and geographical origins, J. Agric. Food Chem., 2001, 49, 7, 3278-3283, https://doi.org/10.1021/jf001271w . [all data]

bin Jantan, Basni, et al., 2001
bin Jantan, I.; Basni, I.; Ahmad, A.S.; Ali, N.A.M.; Ahmad, A.R.; Ibrahim, H., Constituents of the rhizome oils of Boesenbergia pandurata (Roxb.) Schlecht from Malaysia, Indonesia and Thailand, Flavour Fragr. J., 2001, 16, 2, 110-112, https://doi.org/10.1002/ffj.956 . [all data]

Bartley and Jacobs, 2000
Bartley, J.P.; Jacobs, A.L., Effects of drying on flavour compounds in Australian-grown ginger (Zingiber officinale), J. Sci. Food Agric., 2000, 80, 2, 209-215, https://doi.org/10.1002/(SICI)1097-0010(20000115)80:2<209::AID-JSFA516>3.0.CO;2-8 . [all data]

Bortolomeazzi, Pizzale, et al., 2000
Bortolomeazzi, R.; Pizzale, L.; Vichi, S.; Piasenzotto, L.; Conte, L.S., GC-MS Characterization of sesquiterpenic hydrocarbons in virgin olive oils, Proceedings 23rd ISCC; CD-ROM, 2000, retrieved from http://www.richrom.com/assets/CD23PDF. [all data]

Menut, Bessiere, et al., 2000
Menut, C.; Bessiere, J.M.; Ntalani, H.; Verin, P.; Henriques, A.T.; Limberger, R., Two chromene derivatives from Calyptranthes tricona, Phytochemistry, 2000, 53, 8, 975-979, https://doi.org/10.1016/S0031-9422(99)00601-9 . [all data]

Verzera, la Rosa, et al., 2000
Verzera, A.; la Rosa, G.; Zappalà, M.; Cotroneo, A., Essential oil composition of different cultivars of bergamot grown in Sicily, Ital. J. Food Sci., 2000, 12, 4, 493-501. [all data]

Lazari, Skaltsa, et al., 1999
Lazari, D.M.; Skaltsa, H.D.; Constantinidis, T., Essential oils of Marrubium velutinum Sm. and Marrubium peregrinum L., growing wild in Greece, Flavour Fragr. J., 1999, 14, 5, 290-292, https://doi.org/10.1002/(SICI)1099-1026(199909/10)14:5<290::AID-FFJ828>3.0.CO;2-4 . [all data]

Mirza and Sefidkon, 1999
Mirza, M.; Sefidkon, F., Essential oil composition of two Salvia species from Iran, Salvia nemorosa L. and Salvia reuterana Boiss., Flavour Fragr. J., 1999, 14, 4, 230-232, https://doi.org/10.1002/(SICI)1099-1026(199907/08)14:4<230::AID-FFJ816>3.0.CO;2-L . [all data]