Phosphabenzene

Gas phase ion energetics data

Data evaluated as indicated in comments:
HL - Edward P. Hunter and Sharon G. Lias

Data compiled as indicated in comments:
LLK - Sharon G. Lias, Rhoda D. Levin, and Sherif A. Kafafi

Quantity Value Units Method Reference Comment
Proton affinity (review)817.7kJ/molN/AHunter and Lias, 1998HL
Quantity Value Units Method Reference Comment
Gas basicity785.3kJ/molN/AHunter and Lias, 1998HL

Ionization energy determinations

IE (eV) Method Reference Comment
9.0PEAshe, Burger, et al., 1976LLK
9.2PEBatich, Heilbronner, et al., 1973Vertical value; LLK

References

Hunter and Lias, 1998
Hunter, E.P.; Lias, S.G., Evaluated Gas Phase Basicities and Proton Affinities of Molecules: An Update, J. Phys. Chem. Ref. Data, 1998, 27, 3, 413-656, https://doi.org/10.1063/1.556018 . [all data]

Ashe, Burger, et al., 1976
Ashe, A.J., III; Burger, F.; El-Sheik, M.Y.; Heilbronner, E.; Maier, J.P.; Muller, J.-F., 202. Angular- and energy-dependence of band intensities in the photoelectron spectra of phosphabenzene and arsabenzene, Helv. Chim. Acta, 1976, 59, 1944. [all data]

Batich, Heilbronner, et al., 1973
Batich, C.; Heilbronner, E.; Hornung, V.; Ashe, A.J.; Clark, D.T.; Cobley, U.T.; Kilcast, D.; Scanlan, I., Photoelectron spectra of phosphabenzen, arsabenzene, and stibabenzene, J. Am. Chem. Soc., 1973, 95, 928. [all data]