1,3-Diamino-2,4,6-trinitrobenzene

Phase change data

Data compiled by: William E. Acree, Jr., James S. Chickos

Quantity Value Units Method Reference Comment
Δsub143.5kJ/molN/ACundall, Frank Palmer, et al., 1978

Enthalpy of sublimation

ΔsubH (kJ/mol) Temperature (K) Method Reference Comment
140.350.LEStephenson and Malanowski, 1987Based on data from 335. - 382. K. See also Rosen and Dickinson, 1969.

References

Cundall, Frank Palmer, et al., 1978
Cundall, Robert B.; Frank Palmer, T.; Wood, Colin E.C., Vapour pressure measurements on some organic high explosives, J. Chem. Soc., Faraday Trans. 1, 1978, 74, 0, 1339, https://doi.org/10.1039/f19787401339 . [all data]

Stephenson and Malanowski, 1987
Stephenson, Richard M.; Malanowski, Stanislaw, Handbook of the Thermodynamics of Organic Compounds, 1987, https://doi.org/10.1007/978-94-009-3173-2 . [all data]

Rosen and Dickinson, 1969
Rosen, Jerome M.; Dickinson, Charles, Vapor pressures and heats of sublimation of some high-melting organic explosives, J. Chem. Eng. Data, 1969, 14, 1, 120-124, https://doi.org/10.1021/je60040a044 . [all data]