Isobutyraldehyde ethylimine

Reaction thermochemistry data

Data compiled by: Hussein Y. Afeefy, Joel F. Liebman, and Stephen E. Stein

Individual Reactions

Hydrogen + Isobutyraldehyde ethylimine = 1-Propanamine, N-(1-methylethyl)-

By formula: H2 + C6H13N = C6H15N

Quantity Value Units Method Reference Comment
Δr87. ± 1.kJ/molChydJackman and Packham, 1957liquid phase; solvent: bis-2-Ethoxyethyl ether

Gas phase ion energetics data

Data compiled as indicated in comments:
LLK - Sharon G. Lias, Rhoda D. Levin, and Sherif A. Kafafi

Ionization energy determinations

IE (eV) Method Reference Comment
8.5 ± 0.2EILeduc and Rousseau, 1974LLK

References

Jackman and Packham, 1957
Jackman, L.M.; Packham, D.I., The experimental resonance energy of acridine, Proc. Chem. Soc., London, 1957, 349-350. [all data]

Leduc and Rousseau, 1974
Leduc, G.; Rousseau, Y., Spectrometrie de masse d'imines aliphatiques, Can. J. Chem., 1974, 52, 1648. [all data]