β-D-Glucopyranose

Condensed phase thermochemistry data

Data compiled by: Hussein Y. Afeefy, Joel F. Liebman, and Stephen E. Stein

Quantity Value Units Method Reference Comment
Δfsolid-1268.3kJ/molCmHuffman and Fox, 1938Author's hf298_condensed=-304.23 kcal/mol
Quantity Value Units Method Reference Comment
Δcsolid-2723.kJ/molCcbGorokhov and Sryvalin, 1973Corresponding Δfsolid = -1353. kJ/mol (simple calculation by NIST; no Washburn corrections)
Δcsolid-2807.8kJ/molCmHuffman and Fox, 1938Author's hf298_condensed=-304.23 kcal/mol; Corresponding Δfsolid = -1268.3 kJ/mol (simple calculation by NIST; no Washburn corrections)

References

Huffman and Fox, 1938
Huffman, H.M.; Fox, S.W., Thermal data. X. The heats of combustion and free energies, at 25°, of some organic compounds concerned in carbohydrate metabolism, J. Am. Chem. Soc., 1938, 60, 1400-1403. [all data]

Gorokhov and Sryvalin, 1973
Gorokhov, G.I.; Sryvalin, I.T., Determination of the enthalpy of hydrolysis of carbohydrates from a homologous series of glucose, Izv. Vyssh. Uchebn. Zaved., Khim. Khim. Tekhnol., 1973, 43-45. [all data]