1,2,4-Benzenetricarboxylic acid, trimethyl ester

Phase change data

Data compiled by: William E. Acree, Jr., James S. Chickos

Enthalpy of vaporization

ΔvapH (kJ/mol) Temperature (K) Method Reference Comment
78.5 ± 0.4399.CMaksimuk, Kabo, et al., 1998
61.1458.A,GSStephenson and Malanowski, 1987Based on data from 443. - 493. K. See also Kraus, Beranek, et al., 1962.

References

Maksimuk, Kabo, et al., 1998
Maksimuk, Yury V.; Kabo, Gennady J.; Simirsky, Vladimir V.; Kozyro, Alexander A.; Sevruk, Victor M., Standard Enthalpies of Formation of Some Methyl Esters of Benzene Carboxylic Acids, J. Chem. Eng. Data, 1998, 43, 3, 293-298, https://doi.org/10.1021/je970116j . [all data]

Stephenson and Malanowski, 1987
Stephenson, Richard M.; Malanowski, Stanislaw, Handbook of the Thermodynamics of Organic Compounds, 1987, https://doi.org/10.1007/978-94-009-3173-2 . [all data]

Kraus, Beranek, et al., 1962
Kraus, M.; Beranek, L.; Kochloeff, K.; Bazant, V., Chem. Prum., 1962, 12, 649. [all data]