1-Methoxy-1,4-cyclohexadiene

Reaction thermochemistry data

Data compiled by: Hussein Y. Afeefy, Joel F. Liebman, and Stephen E. Stein

Individual Reactions

2-Methoxy-1,3-cyclohexadiene = 1-Methoxy-1,4-cyclohexadiene

By formula: C7H10O = C7H10O

Quantity Value Units Method Reference Comment
Δr-7.0 ± 1.5kJ/molEqkTaskinen and Nummelin, 1986liquid phase; solvent: Cyclohexane; GLC

1-Methoxy-1,4-cyclohexadiene = 1-Methoxy-1,3-cyclohexadiene

By formula: C7H10O = C7H10O

Quantity Value Units Method Reference Comment
Δr-2.1 ± 0.5kJ/molEqkTaskinen and Nummelin, 1986liquid phase; solvent: Cyclohexane; GLC

Phase change data

Data compiled by: Robert L. Brown and Stephen E. Stein

Quantity Value Units Method Reference Comment
Tboil422.2KN/AAldrich Chemical Company Inc., 1990

References

Taskinen and Nummelin, 1986
Taskinen, E.; Nummelin, K., Thermodynamics of vinyl ethers. 31. Isomer equilibria in some six- and seven-membered cyclic dienes, J. Org. Chem., 1986, 50, 4844-4847. [all data]