Thorium difluoride

Gas phase ion energetics data

Data compiled as indicated in comments:
LL - Sharon G. Lias and Joel F. Liebman
RDSH - Henry M. Rosenstock, Keith Draxl, Bruce W. Steiner, and John T. Herron

Ionization energy determinations

IE (eV) Method Reference Comment
6.0 ± 0.3EILau, Brittain, et al., 1989LL
13.1 ± 0.6EIZmbov, 1970RDSH

Appearance energy determinations

Ion AE (eV) Other Products MethodReferenceComment
FTh+14. ± 1.FEILau, Brittain, et al., 1989LL

References

Lau, Brittain, et al., 1989
Lau, K.H.; Brittain, R.D.; Hildenbrand, D.L., High temperature thermodynamic studies of some gaseous thorium fluorides, J. Chem. Phys., 1989, 90, 1158. [all data]

Zmbov, 1970
Zmbov, K.F., Heats of formation of gaseous ThF3 and ThF2 from mass spectrometric studies, J. Inorg. Nucl. Chem., 1970, 32, 1381. [all data]