2H-1,2,3-triazole

Ion clustering data

Data compiled by: Robert C. Dunbar

Clustering reactions

Potassium ion (1+) + C2H3N3 = (Potassium ion (1+) • C2H3N3)

By formula: K+ + C2H3N3 = (K+ • C2H3N3)

Quantity Value Units Method Reference Comment
Δr13.1 ± 1.4kcal/molCIDTRodgers and Armentrout, 2000

Lithium ion (1+) + C2H3N3 = (Lithium ion (1+) • C2H3N3)

By formula: Li+ + C2H3N3 = (Li+ • C2H3N3)

Quantity Value Units Method Reference Comment
Δr32.5 ± 1.7kcal/molCIDTRodgers and Armentrout, 2000

Sodium ion (1+) + C2H3N3 = (Sodium ion (1+) • C2H3N3)

By formula: Na+ + C2H3N3 = (Na+ • C2H3N3)

Quantity Value Units Method Reference Comment
Δr22.9 ± 1.0kcal/molCIDTRodgers and Armentrout, 2000

Free energy of reaction

ΔrG° (kcal/mol) T (K) Method Reference
0.00.CIDTRodgers and Armentrout, 2000

References

Rodgers and Armentrout, 2000
Rodgers, M.T.; Armentrout, P.B., Noncovalent Metal-Ligand Bond Energies as Studied by Threshold Collision-Induced Dissociation, Mass Spectrom. Rev., 2000, 19, 4, 215, https://doi.org/10.1002/1098-2787(200007)19:4<215::AID-MAS2>3.0.CO;2-X . [all data]