2,4-Hexadiene, 2-methyl-

Phase change data

Data compiled by: Thermodynamics Research Center, NIST Boulder Laboratories, Chris Muzny director

Quantity Value Units Method Reference Comment
Tboil384.7KN/AHenne and Turk, 1942Uncertainty assigned by TRC = 2. K
Tboil380.KN/AZiegler, Spath, et al., 1942Uncertainty assigned by TRC = 2. K
Quantity Value Units Method Reference Comment
Tfus198.6KN/AHenne and Turk, 1942Uncertainty assigned by TRC = 2. K

In addition to the Thermodynamics Research Center (TRC) data available from this site, much more physical and chemical property data is available from the following TRC products:

Normal alkane RI, non-polar column, temperature ramp

View large format table.

Column type Active phase I Reference Comment
CapillaryOV-101751.Orav, Kailas, et al., 199950. m/0.20 mm/0.50 μm, Helium, 30. C @ 6. min, 1. K/min; Tend: 100. C

Normal alkane RI, non-polar column, custom temperature program

View large format table.

Column type Active phase I Reference Comment
CapillaryDB-1706.Ciccioli, Cecinato, et al., 199460. m/0.32 mm/0.25 μm; Program: not specified

References

Henne and Turk, 1942
Henne, A.L.; Turk, A., Conjugated diolefins by double bond displacement, J. Am. Chem. Soc., 1942, 64, 826-8. [all data]

Ziegler, Spath, et al., 1942
Ziegler, K.; Spath, A.; Schaaf, E.; Schumann, W.; Winkelman, E., Halogenation of Unsaturated Substances in the Allyl Postion, Justus Liebigs Ann. Chem., 1942, 551, 80-119. [all data]