2,4,6-Tris(2-fluoro-2,2-dinitroethoxy)-1,3,5-triazine

Condensed phase thermochemistry data

Data compiled by: Hussein Y. Afeefy, Joel F. Liebman, and Stephen E. Stein

Quantity Value Units Method Reference Comment
Δfsolid-265.25 ± 0.37kcal/molCcrJohnson and Prosen, 1985
Quantity Value Units Method Reference Comment
Δcsolid-914.82 ± 0.29kcal/molCcrJohnson and Prosen, 1985

References

Johnson and Prosen, 1985
Johnson, W.H.; Prosen, E.J., Determination of the enthalpies of combustion and formation of substituted triazines in an adiabatic rotating bomb calorimeter, J. Res. NBS, 1985, 90, 295-303. [all data]