C4H5P

Gas phase ion energetics data

Data compiled by: John E. Bartmess

De-protonation reactions

C4H4P- + Hydrogen cation = C4H5P

By formula: C4H4P- + H+ = C4H5P

Quantity Value Units Method Reference Comment
Δr1415. ± 13.kJ/molG+TSSunderlin, Panu, et al., 1994gas phase; Between FCH2CO2H and MeCHClCO2H. structure: P analog of pyrrole. Probably C protonation.
Quantity Value Units Method Reference Comment
Δr1385. ± 13.kJ/molIMRBSunderlin, Panu, et al., 1994gas phase; Between FCH2CO2H and MeCHClCO2H. structure: P analog of pyrrole. Probably C protonation.

Reaction thermochemistry data

Data compiled by: John E. Bartmess

Individual Reactions

C4H4P- + Hydrogen cation = C4H5P

By formula: C4H4P- + H+ = C4H5P

Quantity Value Units Method Reference Comment
Δr1415. ± 13.kJ/molG+TSSunderlin, Panu, et al., 1994gas phase; Between FCH2CO2H and MeCHClCO2H. structure: P analog of pyrrole. Probably C protonation.
Quantity Value Units Method Reference Comment
Δr1385. ± 13.kJ/molIMRBSunderlin, Panu, et al., 1994gas phase; Between FCH2CO2H and MeCHClCO2H. structure: P analog of pyrrole. Probably C protonation.

References

Sunderlin, Panu, et al., 1994
Sunderlin, L.S.; Panu, D.; Puranik, D.B.; Ashe, A.J.; Squires, R.R., Gas-phase properties and reactivities of phospholide and arsolide anions, Organomet., 1994, 13, 12, 4732, https://doi.org/10.1021/om00024a019 . [all data]