1,3-dithietane

Van Den Dool and Kratz RI, non-polar column, temperature ramp

Data compiled by: NIST Mass Spectrometry Data Center, William E. Wallace, director

Column type Capillary
Active phase OV-1
Column length (m) 50.
Carrier gas H2
Substrate
Column diameter (mm) 0.2
Phase thickness (μm)
Tstart (C) 50.
Tend (C) 280.
Heat rate (K/min) 4.
Initial hold (min)
Final hold (min) 50.
I 786.
ReferenceChen and Ho, 1986
Comment MSDC-RI

References

Chen and Ho, 1986
Chen, C.-C.; Ho, C.-T., Identification of sulfurous compounds of shiitake mushroom (Lentinus edodes Sing.), J. Agric. Food Chem., 1986, 34, 5, 830-833, https://doi.org/10.1021/jf00071a016 . [all data]