Mercury,di-3-thienyl-

Gas phase ion energetics data

Data compiled by: Sharon G. Lias, Rhoda D. Levin, and Sherif A. Kafafi

Ionization energy determinations

IE (eV) Method Reference Comment
8.72PEColonna, Distefano, et al., 1979Vertical value

References

Colonna, Distefano, et al., 1979
Colonna, F.P.; Distefano, G.; Guerra, M.; Jones, D.; Modelli, A., Furyl- and thienyl-mercury derivatives studied by means of ultraviolet photoelectron spectroscopy. Evidence for the participation in bonding of the vacant 6p π orbitals of mercury in bis-2-furyl-bis-2-thienylmercury, J. Chem. Soc. Dalton Trans., 1979, 2037. [all data]