Pyridine, 2,3,5,6-tetrafluoro-

Phase change data

Data compiled by: Robert L. Brown and Stephen E. Stein

Quantity Value Units Method Reference Comment
Tboil375.2KN/AAldrich Chemical Company Inc., 1990

Gas phase ion energetics data

Data compiled by: John E. Bartmess

Electron affinity determinations

EA (eV) Reference Comment
0.400 ± 0.080Van Doren, Kerr, et al., 2005

References

Aldrich Chemical Company Inc., 1990
Aldrich Chemical Company Inc., Catalog Handbook of Fine Chemicals, Aldrich Chemical Company, Inc., Milwaukee WI, 1990, 1. [all data]

Van Doren, Kerr, et al., 2005
Van Doren, J.M.; Kerr, D.M.; Miller, T.M.; Viggiano, A.A., Electron attachment and detachment, and the electron affinities of C5F5N and C5HF4N, J. Chem. Phys., 2005, 123, 11, 114303, https://doi.org/10.1063/1.2032967 . [all data]