2-[ethyl[4-[(4-nitrophenyl)azo]phenyl]amino]ethanol

Condensed phase thermochemistry data

Data compiled by: Hussein Y. Afeefy, Joel F. Liebman, and Stephen E. Stein

Quantity Value Units Method Reference Comment
Δfsolid-55.1 ± 5.3kcal/molCcbVasin, Makarov, et al., 1980
Quantity Value Units Method Reference Comment
Δcsolid-2064.6 ± 5.3kcal/molCcbVasin, Makarov, et al., 1980

Phase change data

Data compiled as indicated in comments:
TRC - Thermodynamics Research Center, NIST Boulder Laboratories, Chris Muzny director
AC - William E. Acree, Jr., James S. Chickos

Quantity Value Units Method Reference Comment
Tfus440.KN/ABaughman and Perenich, 1988Uncertainty assigned by TRC = 1. K; TRC

Enthalpy of sublimation

ΔsubH (kcal/mol) Temperature (K) Method Reference Comment
42.21 ± 0.31426.MEBradley, Bird, et al., 1960Based on data from 420. - 433. K. See also JONES and KRASKA, 2008.; AC

In addition to the Thermodynamics Research Center (TRC) data available from this site, much more physical and chemical property data is available from the following TRC products:

References

Vasin, Makarov, et al., 1980
Vasin, A.Ya.; Makarov, G.V.; Marinina, L.K., Enthalpies of combustion and formation of some aromatic azo compounds, Deposited Document, VINITI 2050-79. Chem. Abst. 93:185571y, 1980, 1-7. [all data]

Baughman and Perenich, 1988
Baughman, G.L.; Perenich, T.A., Fate of dyes in aquatic systems: I. Solubility and partitioning of some hydrophobic dyes and related compounds, Environ. Tox. Chem., 1988, 7, 3, 183, https://doi.org/10.1002/etc.5620070302 . [all data]

Bradley, Bird, et al., 1960
Bradley, R.S.; Bird, C.L.; Jones, F., The vapour pressures and heats of sublimation of some disperse dyes, Trans. Faraday Soc., 1960, 56, 23, https://doi.org/10.1039/tf9605600023 . [all data]

JONES and KRASKA, 2008
JONES, F.; KRASKA, J., Vapour-phase Dyeing of Synthetic-polymer Fibres, J Food Science, 2008, 82, 9, 333-338, https://doi.org/10.1111/j.1478-4408.1966.tb02726.x . [all data]