1-Tridecanamine

Phase change data

Data compiled as indicated in comments:
BS - Robert L. Brown and Stephen E. Stein
TRC - Thermodynamics Research Center, NIST Boulder Laboratories, Chris Muzny director
AC - William E. Acree, Jr., James S. Chickos

Quantity Value Units Method Reference Comment
Tboil538.2KN/AAldrich Chemical Company Inc., 1990BS
Tboil548.KN/AAmerican Tokyo Kasei, 1988BS
Tboil703.15KN/ASudaricov, Phrolov, et al., 1963Uncertainty assigned by TRC = 4. K; TRC
Tboil538.15KN/ALutz, 1886Uncertainty assigned by TRC = 6. K; TRC
Quantity Value Units Method Reference Comment
Tfus300.65KN/AStaudinger and Roessler, 1936Uncertainty assigned by TRC = 2. K; TRC
Tfus300.15KN/ALutz, 1886Uncertainty assigned by TRC = 2. K; TRC

Enthalpy of vaporization

ΔvapH (kJ/mol) Temperature (K) Method Reference Comment
76.8560.AStephenson and Malanowski, 1987Based on data from 545. - 759. K.; AC

In addition to the Thermodynamics Research Center (TRC) data available from this site, much more physical and chemical property data is available from the following TRC products:

References

Aldrich Chemical Company Inc., 1990
Aldrich Chemical Company Inc., Catalog Handbook of Fine Chemicals, Aldrich Chemical Company, Inc., Milwaukee WI, 1990, 1. [all data]

American Tokyo Kasei, 1988
American Tokyo Kasei, TCI American Organic Chemical 88/89 Catalog, American Tokyo Kasei, Portland, OR, 1988, 1610. [all data]

Sudaricov, Phrolov, et al., 1963
Sudaricov, B.N.; Phrolov, U.G.; Ilichev, V.A.I.; Pushcov, A.A.; Zaharov-Narcissov, O.I.; Ochkin, A.B., Physicochemical Properties of Certain n-Aliphatic Amines, Tr. Inst. - Mosk. Khim. -Tekhnol. Inst. im. D. I. Mendele- eva, 1963, 43, 21. [all data]

Lutz, 1886
Lutz, E., The Degradation of Myristic Acid to Lauric Acid, Chem. Ber., 1886, 19, 1433. [all data]

Staudinger and Roessler, 1936
Staudinger, H.; Roessler, K., Highly Polymerized Compounds. CXXIII. Viscosity Measurements on Long- Chain Aliphatic Amines., Chem. Ber., 1936, 69B, 49-60. [all data]

Stephenson and Malanowski, 1987
Stephenson, Richard M.; Malanowski, Stanislaw, Handbook of the Thermodynamics of Organic Compounds, 1987, https://doi.org/10.1007/978-94-009-3173-2 . [all data]