1H-Cyclopropa[b]naphthalene

Condensed phase thermochemistry data

Data compiled by: Hussein Y. Afeefy, Joel F. Liebman, and Stephen E. Stein

Quantity Value Units Method Reference Comment
Δfsolid360. ± 0.8kJ/molCcbBillups, Chow, et al., 1973
Quantity Value Units Method Reference Comment
Δcsolid-5831.7 ± 0.8kJ/molCcbBillups, Chow, et al., 1973Corresponding Δfsolid = 360. kJ/mol (simple calculation by NIST; no Washburn corrections)

References

Billups, Chow, et al., 1973
Billups, W.E.; Chow, W.Y.; Leavell, K.H.; Lewis, E.S.; Margrave, J.L.; Sass, R.L.; Shieh, J.J.; Werness, P.G.; Wood, J.L., Structure and thermochemistry of benzocyclopropenes. Bond fixation and strain energy, J. Am. Chem. Soc., 1973, 95, 7878-7880. [all data]