Bicyclo[3.1.0]hex-2-ene, 2-methyl-5-(1-methylethyl)-

Normal alkane RI, polar column, temperature ramp

Data compiled by: NIST Mass Spectrometry Data Center, William E. Wallace, director

Column type CapillaryCapillaryCapillaryCapillaryCapillary
Active phase RTX-WaxHP-InnowaxDB-WaxSupelcowax-10DB-Wax
Column length (m) 60.30.30.30.30.
Carrier gas HeliumHeliumHeliumHeliumHelium
Substrate
Column diameter (mm) 0.220.250.250.200.25
Phase thickness (μm) 0.250.250.250.200.25
Tstart (C) 60.50.40.70.80.
Tend (C) 230.250.230.220.240.
Heat rate (K/min) 2.5.4.3.3.
Initial hold (min)  5.2.
Final hold (min) 5.10.4.515.2.
I 1011.1035.1023.1030.1029.
ReferenceBendiabdellah, El Amine Dib, et al., 2012Menichini, Tundis, et al., 2011Zeng, Xie, et al., 2011Neves, Rosa, et al., 2010Vahirua-Lechat, Mitermite, et al., 2010
Comment MSDC-RI MSDC-RI MSDC-RI MSDC-RI MSDC-RI
Column type CapillaryCapillaryCapillaryCapillaryCapillary
Active phase RTX-WaxHP-InnowaxHP-InnowaxCP-Wax 52CBCarbowax
Column length (m) 60.30.30.60.60.
Carrier gas HeliumNitrogenN2HeHe
Substrate
Column diameter (mm) 0.220.250.250.250.2
Phase thickness (μm) 0.250.520.250.250.25
Tstart (C) 60.35.50.40.60.
Tend (C) 230.205.240.220.250.
Heat rate (K/min) 2.3.5.3.2.
Initial hold (min)  10.1. 8.
Final hold (min) 30.10.4. 15.
I 1008.1035.1020.1038.1036.
ReferenceMuseli, Pau, et al., 2009Wannes, Mhamdi, et al., 2009Cheraif, Ben Jannet, et al., 2007Chyau, Tsai, et al., 2007Ferhat, Meklati, et al., 2007
Comment MSDC-RI MSDC-RI MSDC-RI MSDC-RI MSDC-RI
Column type CapillaryCapillaryCapillaryCapillaryCapillary
Active phase CP-Wax 52CBSupelcowax-10CP-Wax 52CBSupelcowax-10Carbowax
Column length (m) 30.30.60.30.60.
Carrier gas HeHeHeHeHe
Substrate
Column diameter (mm) 0.320.20.320.250.25
Phase thickness (μm) 0.250.20.50.250.25
Tstart (C) 40.70.40.50.40.
Tend (C) 220.220.220.250.180.
Heat rate (K/min) 3.3.4.2.5.
Initial hold (min) 1. 8.
Final hold (min) 2.15.20.
I 1029.1030.1033.1026.1039.
ReferenceHymete, Rohloff, et al., 2007Pinto, Salgueiro, et al., 2007Povolo, Contarini, et al., 2007Raal, Orav, et al., 2007Singh, Kumar, et al., 2007
Comment MSDC-RI MSDC-RI MSDC-RI MSDC-RI MSDC-RI
Column type CapillaryCapillaryCapillaryCapillaryCapillary
Active phase Supelcowax-10Supelcowax-10InnowaxInnowaxAT-Wax
Column length (m) 30.30.30.30.60.
Carrier gas  HeN2N2He
Substrate
Column diameter (mm) 0.250.250.250.250.25
Phase thickness (μm) 0.250.250.250.250.25
Tstart (C) 40.40.50.50.60.
Tend (C) 250.250.280.280.200.
Heat rate (K/min) 2.3.9.9.4.
Initial hold (min)  5.3.3.
Final hold (min) 33.10.3.3.20.
I 1031.1022.1033.1035.1040.
ReferenceSylvestre, Pichette, et al., 2007Vichi, Riu-Aumatell, et al., 2007Abdelwahed, Hayder, et al., 2006Abdelwahed, Hayder, et al., 2006Borges, Rojas, et al., 2006
Comment MSDC-RI MSDC-RI MSDC-RI MSDC-RI MSDC-RI
Column type CapillaryCapillaryCapillaryCapillaryCapillary
Active phase BP-20Supelcowax 10BP-20CP-Wax 52CBFFAP
Column length (m) 50.30.50.30.20.
Carrier gas  HeliumHeHeHe
Substrate
Column diameter (mm) 0.220.200.220.320.25
Phase thickness (μm) 0.250.200.250.250.25
Tstart (C) 60.70.60.60.90.
Tend (C) 220.220.220.220.250.
Heat rate (K/min) 2.3.2.3.36.
Initial hold (min)    7.
Final hold (min) 20.15.20.3.
I 1026.1030.1022.1028.1052.
ReferenceBoti, Yao, et al., 2006Cavaleiro, Pinto, et al., 2006Fanciullino, Tomi, et al., 2006Hymete, Rohloff, et al., 2006Kitchlu, Bakshi, et al., 2006
Comment MSDC-RI MSDC-RI MSDC-RI MSDC-RI MSDC-RI
Column type CapillaryCapillaryCapillaryCapillaryCapillary
Active phase SupelcowaxNB-20MSupelcowax-10Supelcowax-10Innowax
Column length (m) 30.30.30.30.50.
Carrier gas N2HeHeHeHe
Substrate
Column diameter (mm) 0.320.20.250.250.2
Phase thickness (μm) 0.250.250.250.250.5
Tstart (C) 50.50.50.50.60.
Tend (C) 200.250.220.250.250.
Heat rate (K/min) 5.2.4.4.2.
Initial hold (min)   1.1.
Final hold (min)   10.10.60.
I 1035.1017.1030.1016.1020.
ReferenceMartin, Joseph, et al., 2006Orav, Raal, et al., 2006Wong, Lim, et al., 2006Wong, Sivasothy, et al., 2006Bendimerad and Bendiab, 2005
Comment MSDC-RI MSDC-RI MSDC-RI MSDC-RI MSDC-RI
Column type CapillaryCapillaryCapillaryCapillaryCapillary
Active phase HP-20MCarbowax 20MStabilwaxHP-20MHP-20M
Column length (m) 50.50.30.50.50.
Carrier gas Helium H2HeliumHelium
Substrate
Column diameter (mm) 0.200.20.320.200.20
Phase thickness (μm) 0.200.250.50.200.20
Tstart (C) 70.60.40.70.70.
Tend (C) 250.250.280.180.180.
Heat rate (K/min) 4.2.6.4.4.
Initial hold (min) 4.60.5.4.4.
Final hold (min) 10. 5.10.10.
I 1031.1039.1022.1031.1031.
ReferenceBezic, Skocibusic, et al., 2005Fernandez, Lizzani-Cuvelier, et al., 2005Jirovetz, Buchbauer, et al., 2005Kulisic, Radonic, et al., 2005Kulisic, Radonic, et al., 2005
Comment MSDC-RI MSDC-RI MSDC-RI MSDC-RI MSDC-RI
Column type CapillaryCapillaryCapillaryCapillaryCapillary
Active phase DB-WaxCP-Wax 52CBDB-WaxSupelcowax-10Supelcowax-10
Column length (m) 60.30.30.30.30.
Carrier gas N2HeHe
Substrate
Column diameter (mm) 0.250.320.250.250.25
Phase thickness (μm) 0.250.250.250.250.25
Tstart (C) 70.40.40.40.40.
Tend (C) 230.220.250.210.220.
Heat rate (K/min) 2.4.4.2.3.
Initial hold (min) 2.1. 2.5.
Final hold (min) 20. 10.33.10.
I 1014.1028.1018.1017.1022.
ReferenceNjoroge, Koaze, et al., 2005Rohloff and Bones, 2005Salehi, Sonboli, et al., 2005Stevanovic, Garneau, et al., 2005Vichi, Riu-Aumatell, et al., 2005
Comment MSDC-RI MSDC-RI MSDC-RI MSDC-RI MSDC-RI
Column type CapillaryCapillaryCapillaryCapillaryCapillary
Active phase DB-WaxSupelcowax-10Supelcowax-10Supelcowax-10NB-20M
Column length (m) 30.30.50.50.50.
Carrier gas He HeHeHe
Substrate
Column diameter (mm) 0.250.250.20.20.2
Phase thickness (μm) 0.250.250.250.250.25
Tstart (C) 90.40.70.70.50.
Tend (C) 220.210.230.230.250.
Heat rate (K/min) 7.2.2.2.2.
Initial hold (min) 2.2.
Final hold (min) 5.33.
I 1052.1031.1028.1029.1021.
ReferenceAgnihotri, Thappa, et al., 2004Lopez Arze, Collin, et al., 2004Orav, Stulova, et al., 2004Orav, Stulova, et al., 2004Raal, Arak, et al., 2004
Comment MSDC-RI MSDC-RI MSDC-RI MSDC-RI MSDC-RI
Column type CapillaryCapillaryCapillaryCapillaryCapillary
Active phase HP-WaxHP-20MSupelcowax-10HP-InnowaxInnowax
Column length (m) 30.50.50.50.60.
Carrier gas N2HeHe He
Substrate
Column diameter (mm) 0.250.20.20.20.25
Phase thickness (μm) 0.250.20.250.2
Tstart (C) 60.70.70.50.60.
Tend (C) 220.180.230.220.220.
Heat rate (K/min) 5.4.2.4.4.
Initial hold (min) 10.4. 5.10.
Final hold (min)  10.  10.
I 1038.1035.1029.1035.1035.
ReferenceBertoli, Menichini, et al., 2003Juteau, Jerkovic, et al., 2003Orav, Kailas, et al., 2003Stashenko, Jaramillo, et al., 2003Suleimenov, Atazharova, et al., 2003
Comment MSDC-RI MSDC-RI MSDC-RI MSDC-RI MSDC-RI
Column type CapillaryCapillaryCapillaryCapillaryCapillary
Active phase HP-InnowaxCarbowax 20MDB-WaxSupelcowax-10EC-1000
Column length (m) 50.25.60.60.30.
Carrier gas HeN2H2HeHe
Substrate
Column diameter (mm) 0.20.250.320.20.25
Phase thickness (μm) 0.20.250.250.50.25
Tstart (C) 70.50.40.70.35.
Tend (C) 190.250.245.220.230.
Heat rate (K/min) 5.4.1.52.5.
Initial hold (min)     5.
Final hold (min)  10.20. 15.
I 1038.1030.1021.1029.1045.
ReferenceVelasco-Negueruela, Pérez-Alonso, et al., 2003Zrira, Elamrani, et al., 2003Gancel, Ollé, et al., 2002Orav, Kailas, et al., 2002Bendall, 2001
Comment MSDC-RI MSDC-RI MSDC-RI MSDC-RI MSDC-RI
Column type CapillaryCapillaryCapillaryCapillaryCapillary
Active phase DB-WaxBP-20PEG-20MDB-WaxBP-20
Column length (m) 60.50.50.60.25.
Carrier gas HeHeHe Nitrogen
Substrate
Column diameter (mm) 0.250.220.20.250.50
Phase thickness (μm) 0.250.25 0.250.25
Tstart (C) 45.60.70.30.60.
Tend (C) 240.230.220.170.200.
Heat rate (K/min) 3.2.2.2.5.
Initial hold (min)    4.
Final hold (min)  35. 30.
I 1025.1021.1029.1022.1017.
ReferenceChristoph, 2001Lota, de Rocca Serra, et al., 2001Orav and Kann, 2001Buttery, Light, et al., 2000Mallavarapu, Rao, et al., 2000
Comment MSDC-RI MSDC-RI MSDC-RI MSDC-RI MSDC-RI
Column type CapillaryCapillaryCapillaryCapillaryCapillary
Active phase HP-20MDB-WaxInnowaxNB-351BP-20
Column length (m) 50.60.60.25.25.
Carrier gas HeHeHeH2N2
Substrate
Column diameter (mm) 0.200.250.250.30.5
Phase thickness (μm) 0.200.250.250.5
Tstart (C) 70.40.60.70.60.
Tend (C) 180.200.220.250.200.
Heat rate (K/min) 4.2. 5.5.
Initial hold (min) 4.2.10.2.
Final hold (min)
I 1034.1024.1035.1019.1019.
ReferenceMastelic, Milos, et al., 2000Umano, Hagi, et al., 2000Kaya, Baser, et al., 1999Onocha, Ekundayo, et al., 1999Rao, Bhattacharya, et al., 1999
Comment MSDC-RI MSDC-RI MSDC-RI MSDC-RI MSDC-RI
Column type CapillaryCapillaryCapillaryCapillaryCapillary
Active phase DB-WaxDB-WaxHP-InnowaxSupelcowax-10SP-1000
Column length (m) 60.30.60.30.85.
Carrier gas N2N2He He
Substrate
Column diameter (mm)  0.250.250.250.50
Phase thickness (μm) 0.250.250.25
Tstart (C) 60.45.50.60.65.
Tend (C) 220.220.220.240.225.
Heat rate (K/min) 5.3.5.4.3.
Initial hold (min)   5.
Final hold (min)
I 1033.1021.1020.1033.1025.
ReferenceWeyerstahl, Marschall, et al., 1999Mölleken, Sinnwell, et al., 1998Stashenko, Cervantes, et al., 1998Zunino, Novillo-Newton, et al., 1997Brophy, Goldsack, et al., 1996
Comment MSDC-RI MSDC-RI MSDC-RI MSDC-RI MSDC-RI
Column type CapillaryCapillaryCapillaryCapillaryCapillary
Active phase DB-WaxSupelcowax-10Carbowax 20MCarbowax 20MFFAP
Column length (m) 60.60.60.45.50.
Carrier gas HeHeHeHydrogen
Substrate
Column diameter (mm) 0.250.250.250.32
Phase thickness (μm) 0.250.250.251.0
Tstart (C) 50.40.50.60.50.
Tend (C) 180.200.150.200.180.
Heat rate (K/min) 2.53.2.2.10.
Initial hold (min) 5.3.10.5.1.
Final hold (min)  30.20.
I 1022.1033.1025.1037.1039.
ReferenceStashenko, Puertas, et al., 1996Wong and Lai, 1996Tirado, Stashenko, et al., 1995Kollmannsberger, Nitz, et al., 1992Brophy, Davies, et al., 1989
Comment MSDC-RI MSDC-RI MSDC-RI MSDC-RI MSDC-RI

Kovats' RI, non-polar column, isothermal

Data compiled by: NIST Mass Spectrometry Data Center, William E. Wallace, director

Column type CapillaryCapillaryCapillaryCapillaryCapillary
Active phase ZB-1ZB-1ZB-1ZB-1ZB-1
Column length (m) 30.30.30.30.30.
Carrier gas HeHeHeHeHe
Substrate
Column diameter (mm) 0.320.320.320.320.32
Phase thickness (μm) 0.250.250.250.250.25
Temperature (C) 100.110.120.40.50.
I 941.65945.05948.55922.45925.48
ReferenceHoskovec, Grygarová, et al., 2005Hoskovec, Grygarová, et al., 2005Hoskovec, Grygarová, et al., 2005Hoskovec, Grygarová, et al., 2005Hoskovec, Grygarová, et al., 2005
Comment MSDC-RI MSDC-RI MSDC-RI MSDC-RI MSDC-RI
Column type CapillaryCapillaryCapillaryCapillaryCapillary
Active phase ZB-1ZB-1ZB-1ZB-1OV-1
Column length (m) 30.30.30.30.25.
Carrier gas HeHeHeHeHe
Substrate
Column diameter (mm) 0.320.320.320.320.2
Phase thickness (μm) 0.250.250.250.250.5
Temperature (C) 60.70.80.90.100.
I 928.57931.72934.99938.26931.69
ReferenceHoskovec, Grygarová, et al., 2005Hoskovec, Grygarová, et al., 2005Hoskovec, Grygarová, et al., 2005Hoskovec, Grygarová, et al., 2005Tarján, Bitter, et al., 2002
Comment MSDC-RI MSDC-RI MSDC-RI MSDC-RI MSDC-RI
Column type CapillaryCapillaryCapillaryCapillaryCapillary
Active phase OV-1OV-1OV-1OV-1OV-1
Column length (m) 25.25.25.25.25.
Carrier gas HeHeHeHeHe
Substrate
Column diameter (mm) 0.20.20.20.20.2
Phase thickness (μm) 0.50.50.50.50.5
Temperature (C) 110.120.130.140.150.
I 934.00936.937.75939.29940.67
ReferenceTarján, Bitter, et al., 2002Tarján, Bitter, et al., 2002Tarján, Bitter, et al., 2002Tarján, Bitter, et al., 2002Tarján, Bitter, et al., 2002
Comment MSDC-RI MSDC-RI MSDC-RI MSDC-RI MSDC-RI
Column type CapillaryCapillaryCapillaryCapillaryCapillary
Active phase OV-1OV-1DB-1SE-30SE-30
Column length (m) 25.25.28.80.80.
Carrier gas HeHeHe
Substrate
Column diameter (mm) 0.20.20.250.50.5
Phase thickness (μm) 0.50.50.250.80.8
Temperature (C) 80.90.150.100.110.
I 925.82929.00924.933.1934.7
ReferenceTarján, Bitter, et al., 2002Tarján, Bitter, et al., 2002Viswanathan, Maridass, et al., 2002Saeed, Redant, et al., 1979Saeed, Redant, et al., 1979
Comment MSDC-RI MSDC-RI MSDC-RI MSDC-RI MSDC-RI
Column type Capillary
Active phase SE-30
Column length (m) 80.
Carrier gas
Substrate
Column diameter (mm) 0.5
Phase thickness (μm) 0.8
Temperature (C) 130.
I 935.
ReferenceSaeed, Redant, et al., 1979
Comment MSDC-RI

Normal alkane RI, non-polar column, temperature ramp

Data compiled by: NIST Mass Spectrometry Data Center, William E. Wallace, director

Column type CapillaryCapillaryCapillaryCapillaryCapillary
Active phase HP-1RTX-1RTX-1Mega-5HP-5 MS
Column length (m) 30.60.60.25.30.
Carrier gas HeliumHeliumHeliumHeliumHelium
Substrate
Column diameter (mm) 0.250.220.220.250.25
Phase thickness (μm) 0.250.250.250.250.25
Tstart (C) 60.60.60.50.35.
Tend (C) 240.230.230.220.300.
Heat rate (K/min) 3.2.2.3.3.
Initial hold (min)    1.5.
Final hold (min)  5.5.5.15.
I 928.932.932.929.929.
ReferenceAlizadeh and Shaabani, 2012Bendiabdellah, El Amine Dib, et al., 2012Bendiabdellah, El Amine Dib, et al., 2012Dell'Agli, Sanna, et al., 2012Kotowska, Zalikowski, et al., 2012
Comment MSDC-RI MSDC-RI MSDC-RI MSDC-RI MSDC-RI
Column type CapillaryCapillaryCapillaryCapillaryCapillary
Active phase HP-5HP-5HP-5HP-5 MSHP-1
Column length (m) 25.25.25.30.30.
Carrier gas HydrogenHydrogenHydrogenHeliumHelium
Substrate
Column diameter (mm) 0.320.320.320.250.25
Phase thickness (μm) 0.520.520.520.250.25
Tstart (C) 40.40.40.50.60.
Tend (C) 280.280.280.250.240.
Heat rate (K/min) 4.4.4.7.3.
Initial hold (min)    1.
Final hold (min) 10.10.10.5.
I 922.922.922.929.928.
ReferenceVelickovic, Ristic, et al., 2012Velickovic, Ristic, et al., 2012Velickovic, Ristic, et al., 2012Zouari, Ayadi, et al., 2012Alizadeh, Khosh-Khui, et al., 2011
Comment MSDC-RI MSDC-RI MSDC-RI MSDC-RI MSDC-RI
Column type CapillaryCapillaryCapillaryCapillaryCapillary
Active phase CP-Sil 5 CBHP-5DB-5CP-Sil 5 CBDB-1
Column length (m) 25.30.30.25.30.
Carrier gas HeliumHeliumHeliumHydrogenHelium
Substrate
Column diameter (mm) 0.250.250.250.250.25
Phase thickness (μm) 0.150.250.250.150.25
Tstart (C) 50.60.40.50.40.
Tend (C) 220.240.250.230.210.
Heat rate (K/min)  3.3.3.5.
Initial hold (min)   5.
Final hold (min)   20.
I 926.930.928.935.934.
ReferenceAmeen, Usman, et al., 2011Bertoli, Lepnardi, et al., 2011Cao, Li, et al., 2011Esseien, Aboaba, et al., 2011Fathi, Sahari, et al., 2011
Comment MSDC-RI MSDC-RI MSDC-RI MSDC-RI MSDC-RI
Column type CapillaryCapillaryCapillaryCapillaryCapillary
Active phase HP-5 MSVF-5 MSVF-5 MSSE-30 MSCP-Sil 5 CB
Column length (m) 30.60.60.30.30.
Carrier gas HeliumHeliumHeliumHeliumNitrogen
Substrate
Column diameter (mm) 0.250.320.320.250.25
Phase thickness (μm) 0.250.250.250.250.26
Tstart (C) 50.30.30.50.45.
Tend (C) 180.260.260.250.280.
Heat rate (K/min) 2.2.2.5.3.
Initial hold (min)    5.
Final hold (min)  28.28.10.22.
I 919.925.929.926.926.
ReferenceHammami, Kamoun, et al., 2011Leffingwell and Alford, 2011Leffingwell and Alford, 2011Menichini, Tundis, et al., 2011Mothana, Hasson, et al., 2011
Comment MSDC-RI MSDC-RI MSDC-RI MSDC-RI MSDC-RI
Column type CapillaryCapillaryCapillaryCapillaryCapillary
Active phase RTX-5DB-5 MSDB-5 MSDB-5DB-1
Column length (m) 30.25.25.30.30.
Carrier gas NitrogenHeliumHeliumHeliumHelium
Substrate
Column diameter (mm) 0.320.300.300.320.25
Phase thickness (μm) 0.250.250.250.250.25
Tstart (C) 60.50.50.60.50.
Tend (C) 210.240.240.280.265.
Heat rate (K/min) 3.3.3.3.2.5
Initial hold (min)     1.
Final hold (min)     20.
I 933.926.926.925.917.
ReferencePrasad, Moulekhi, et al., 2011Chalchat, Figueredo, et al., 2010Chalchat, Figueredo, et al., 2010Georgiou, Koutsaviti, et al., 2010Hajimahdipoor, Samadi, et al., 2010
Comment MSDC-RI MSDC-RI MSDC-RI MSDC-RI MSDC-RI
Column type CapillaryCapillaryCapillaryCapillaryCapillary
Active phase DB-5DB-5 MSHP-5SPB-1HP-5 MS
Column length (m) 30.60.30.30.30.
Carrier gas HeliumHeliumHeliumHeliumHelium
Substrate
Column diameter (mm) 0.250.250.250.200.25
Phase thickness (μm) 0.250.250.250.200.25
Tstart (C) 50.40.50.70.60.
Tend (C) 250.250.240.220.220.
Heat rate (K/min) 2.5.3.3.5.
Initial hold (min)  15.5. 10.
Final hold (min)  15. 15.
I 930.924.922.921.931.
ReferenceHo, Wang, et al., 2010Mesa-Arango, Betancur-Galvis, et al., 2010Monsef-Esfahani, Miri, et al., 2010Neves, Rosa, et al., 2010Ogunwande, Flamini, et al., 2010
Comment MSDC-RI MSDC-RI MSDC-RI MSDC-RI MSDC-RI
Column type CapillaryCapillaryCapillaryCapillaryCapillary
Active phase HP-5 MSHP-5SLB-5 MSSLB-5 MSDB-1-MS
Column length (m) 30.30.10.10.60.
Carrier gas HeliumHydrogenHeliumHeliumHelium
Substrate
Column diameter (mm) 0.250.250.100.100.25
Phase thickness (μm) 0.250.250.100.100.25
Tstart (C) 100.70.50.50.30.
Tend (C) 220.290.250.250.200.
Heat rate (K/min) 2.5.10.10.2.
Initial hold (min)     4.
Final hold (min)     35.
I 924.930.924.925.923.
ReferencePripdeevech, Chumpolsri, et al., 2010Radulovic, Dordevic, et al., 2010Scandinaro, Tranchida, et al., 2010Scandinaro, Tranchida, et al., 2010Takeoka, Hobbs, et al., 2010
Comment MSDC-RI MSDC-RI MSDC-RI MSDC-RI MSDC-RI
Column type CapillaryCapillaryCapillaryCapillaryCapillary
Active phase CP Sil 5 CBDB-5DB-5OV-101SE-54
Column length (m) 25.30.30.50.30.
Carrier gas  HeliumHeliumHeliumHelium
Substrate
Column diameter (mm) 0.250.250.250.250.25
Phase thickness (μm) 0.150.250.250.250.25
Tstart (C) 50.80.40.70.60.
Tend (C) 230.240.250.220.260.
Heat rate (K/min) 3.3.10.2.2.
Initial hold (min)   1. 5.
Final hold (min)  2.3. 999.
I 926.926.930.916.928.
ReferenceUsman, Zubair, et al., 2010Vahirua-Lechat, Mitermite, et al., 2010Yang, Zhang, et al., 2010Benites, Moiteiro, et al., 2009Dayisoylu and Alma, 2009
Comment MSDC-RI MSDC-RI MSDC-RI MSDC-RI MSDC-RI
Column type CapillaryCapillaryCapillaryCapillaryCapillary
Active phase HP-5 MSSPB-5DB-5DB-5HP-5MS
Column length (m) 30.60.30.50.60.
Carrier gas HeliumNitrogenHeliumNitrogenHelium
Substrate
Column diameter (mm) 0.250.350.250.200.25
Phase thickness (μm) 0.250.250.250.320.25
Tstart (C) 60.60.50.60.70.
Tend (C) 250.230.250.220.250.
Heat rate (K/min) 2.4.5.5.3.
Initial hold (min) 8. 2.3.
Final hold (min) 15.40.
I 937.930.930.931.930.
ReferenceFarhat, Ginies, et al., 2009Gauvin-Bialecki and Marodon, 2009Ho, Wang, et al., 2009Kazemi and Akhavani, 2009Males, Plazibat, et al., 2009
Comment MSDC-RI MSDC-RI MSDC-RI MSDC-RI MSDC-RI
Column type CapillaryCapillaryCapillaryCapillaryCapillary
Active phase VF-1 MSRTX-1RTX-1DB-5DB-5
Column length (m) 30.60.60.30.30.
Carrier gas HeliumHeliumHeliumHeliumNitrogen
Substrate
Column diameter (mm) 0.250.220.220.250.25
Phase thickness (μm) 0.250.250.250.250.25
Tstart (C) 60.60.60.45.40.
Tend (C) 280.230.230.250.250.
Heat rate (K/min) 4.2.2.3.3.
Initial hold (min) 5.  3.1.
Final hold (min) 10.30.30.5.10.
I 922.921.932.929.926.
ReferenceMarchesini, Prada, et al., 2009Museli, Pau, et al., 2009Museli, Pau, et al., 2009Porto, Decorti, et al., 2009Rahmi-Nasrabadi, Gholivand, et al., 2009
Comment MSDC-RI MSDC-RI MSDC-RI MSDC-RI MSDC-RI
Column type CapillaryCapillaryCapillaryCapillaryCapillary
Active phase DB-5DB-5 MSHP-5MSHP-5HP-5
Column length (m) 30.30.30.30.30.
Carrier gas NitrogenHeliumHeliumHeliumHelium
Substrate
Column diameter (mm) 0.250.250.250.320.25
Phase thickness (μm) 0.250.250.250.250.25
Tstart (C) 40.40.50.40.50.
Tend (C) 230.250.240.240.280.
Heat rate (K/min) 2.4.5.4.9.
Initial hold (min)  2. 4.3.
Final hold (min)  2.  3.
I 931.928.928.926.930.
ReferenceScrivanti, Anton, et al., 2009Su, Wang, et al., 2009Wannes, Mhamdi, et al., 2009Zhannan, Shiqiong, et al., 2009Aicha, Ines, et al., 2008
Comment MSDC-RI MSDC-RI MSDC-RI MSDC-RI MSDC-RI
Column type CapillaryCapillaryCapillaryCapillaryCapillary
Active phase HP-5SLB-5 MSZB-1DB-5DB-5 MS
Column length (m) 30.30.30.60.30.
Carrier gas N2HeliumNitrogenNitrogenHelium
Substrate
Column diameter (mm) 0.250.250.250.250.25
Phase thickness (μm) 0.250.250.250.250.25
Tstart (C) 60.50.45.60.50.
Tend (C) 220.250.230.250.300.
Heat rate (K/min) 5.3.3.5.5.
Initial hold (min) 10.2.  5.
Final hold (min)  10. 10.5.
I 933.925.922.929.929.
ReferenceFlamini, Tebano, et al., 2008Lo Presti, Sciarrone, et al., 2008Mierendorff, Stahl-Biskup, et al., 2008Mosayebi, Amin, et al., 2008Noudogbessi, Yedomonhan, et al., 2008
Comment MSDC-RI MSDC-RI MSDC-RI MSDC-RI MSDC-RI
Column type CapillaryCapillaryCapillaryCapillaryCapillary
Active phase Elite-1BPX-5RTX-5HP-5OV-1
Column length (m) 30.7.520.25.30.
Carrier gas HeliumHeliumHeliumHeliumHelium
Substrate
Column diameter (mm) 0.320.100.180.250.25
Phase thickness (μm) 0.2510.0.200.250.25
Tstart (C) 60.60.50.60.65.
Tend (C) 246.240.280.240.260.
Heat rate (K/min) 3.3.4.4.6.
Initial hold (min)   1.2.
Final hold (min)
I 923.926.929.933.931.
ReferenceRaj, Baby, et al., 2008Shellie, 2008Skalicka-Wozniak, Los, et al., 2008Verdian-rizi, 2008Wang, Yi, et al., 2008
Comment MSDC-RI MSDC-RI MSDC-RI MSDC-RI MSDC-RI
Column type CapillaryCapillaryCapillaryCapillaryCapillary
Active phase HP-5 MSDB-5MSDB-5HP-5 MSHP-5
Column length (m) 30.30.30.30.30.
Carrier gas HeliumHeHeHeliumN2
Substrate
Column diameter (mm) 0.250.250.260.320.25
Phase thickness (μm) 0.250.250.250.250.25
Tstart (C) 50.60.60.60.50.
Tend (C) 230.240.240.280.240.
Heat rate (K/min) 3.3.3.4.5.
Initial hold (min) 10.  5.1.
Final hold (min) 10.   4.
I 931.931.924.927.931.
ReferenceAdams, Beauchamp, et al., 2007Andrade, Oliveira, et al., 2007Bos, Woerdenbag, et al., 2007Capetanos, Saroglou, et al., 2007Cheraif, Ben Jannet, et al., 2007
Comment MSDC-RI MSDC-RI MSDC-RI MSDC-RI MSDC-RI
Column type CapillaryCapillaryCapillaryCapillaryCapillary
Active phase DB-5DB-5HP-5MSDB-1Col-Elite 5MS
Column length (m) 60.30.30.60.30.
Carrier gas HeHeliumHeNitrogenHe
Substrate
Column diameter (mm) 0.250.260.250.250.25
Phase thickness (μm) 0.250.250.250.250.25
Tstart (C) 40.60.60.60.30.
Tend (C) 220.290.250.250.246.
Heat rate (K/min) 3.3.2.4.3.
Initial hold (min)   8.1.
Final hold (min)   15.10.
I 935.924.920.926.930.
ReferenceChyau, Tsai, et al., 2007Elfami, Bos, et al., 2007Ferhat, Meklati, et al., 2007Ghasempour, Shirinpour, et al., 2007Gudaityte and Venskutonis R.P., 2007
Comment MSDC-RI MSDC-RI MSDC-RI MSDC-RI MSDC-RI
Column type CapillaryCapillaryCapillaryCapillaryCapillary
Active phase HP-1RTX-5 MSDB-5MSZB-5HP-5
Column length (m) 30.30.30.30.25.
Carrier gas HeHeHe H2
Substrate
Column diameter (mm) 0.250.250.250.250.2
Phase thickness (μm) 0.250.250.250.250.33
Tstart (C) 60.45.60.60.60.
Tend (C) 240.210.280.220.240.
Heat rate (K/min) 2.3.3.4.3.
Initial hold (min)    5.
Final hold (min) 20. 30.20.
I 921.928.906.926.931.
ReferenceHachicha, Skanji, et al., 2007Hudaib and Aburjai, 2007Marongiu B., Piras A., et al., 2007Mohottalage, Tabacchi, et al., 2007Oliveira, Leitão, et al., 2007
Comment MSDC-RI MSDC-RI MSDC-RI MSDC-RI MSDC-RI
Column type CapillaryCapillaryCapillaryCapillaryCapillary
Active phase DB-1SPB-1SPB-5BPX-5DB-1
Column length (m) 50.30.30.50.60.
Carrier gas HeHeHeHeNitrogen
Substrate
Column diameter (mm) 0.250.20.250.220.25
Phase thickness (μm) 0.250.20.251.0.25
Tstart (C) 95.70.50.50.60.
Tend (C) 240.220.250.300.250.
Heat rate (K/min) 4.3.2.4.4.
Initial hold (min)    1.1.
Final hold (min)  15. 10.10.
I 927.923.924.940.926.
ReferencePala-Paul, Brophy, et al., 2007Pinto, Salgueiro, et al., 2007Raal, Orav, et al., 2007Rali, Wossa, et al., 2007Reza, Ebrahim, et al., 2007
Comment MSDC-RI MSDC-RI MSDC-RI MSDC-RI MSDC-RI
Column type CapillaryCapillaryCapillaryCapillaryCapillary
Active phase HP-5 MSDB-5DBP-5DB-5DB-5
Column length (m) 60.30.25.30.30.
Carrier gas HydrogenHeHelium Helium
Substrate
Column diameter (mm) 0.250.250.250.250.25
Phase thickness (μm) 0.250.250.220.25
Tstart (C) 60.50.40.40.60.
Tend (C) 260.240.250.250.200.
Heat rate (K/min) 4.4.3.2.2.
Initial hold (min)   1.
Final hold (min) 20. 10.33.20.
I 923.926.899.933.927.
ReferenceRojas, Velasco, et al., 2007Sefidkon, Abbasi, et al., 2007Sereshti and Samadi, 2007Sylvestre, Pichette, et al., 2007Tiwary, Nail, et al., 2007
Comment MSDC-RI MSDC-RI MSDC-RI MSDC-RI MSDC-RI
Column type CapillaryCapillaryCapillaryCapillaryCapillary
Active phase DB-5HP-5MSHP-5 MSHP-5MSHP-5MS
Column length (m) 30.30.30.30.30.
Carrier gas HeliumHeHeliumHeHe
Substrate
Column diameter (mm) 0.250.250.250.250.25
Phase thickness (μm)  0.250.250.250.25
Tstart (C) 60.60.60.40.40.
Tend (C) 200.280.280.250.260.
Heat rate (K/min) 2.3.3.3.4.
Initial hold (min)    5.
Final hold (min) 20.  10.
I 931.909.930.923.927.0
ReferenceTiwary, Nail, et al., 2007Tzakou, Bazos, et al., 2007Vagionas, Graikou, et al., 2007Vichi, Riu-Aumatell, et al., 2007Zizovic, Stamenic, et al., 2007
Comment MSDC-RI MSDC-RI MSDC-RI MSDC-RI MSDC-RI
Column type CapillaryCapillaryCapillaryCapillaryCapillary
Active phase HP-5HP-5DB-5HP-1ZB-5
Column length (m) 30.30.30.50.30.
Carrier gas N2N2HeN2
Substrate
Column diameter (mm) 0.250.250.250.20.25
Phase thickness (μm) 0.250.250.250.330.25
Tstart (C) 50.50.50.60.40.
Tend (C) 280.280.265.250.300.
Heat rate (K/min) 9.9.2.52.2.
Initial hold (min) 3.3.1.
Final hold (min) 3.3.20.20.
I 928.928.929.929.929.
ReferenceAbdelwahed, Hayder, et al., 2006Abdelwahed, Hayder, et al., 2006Bazargani, Almasirad, et al., 2006Berlioz, Cordella, et al., 2006Biondi, Sari, et al., 2006
Comment MSDC-RI MSDC-RI MSDC-RI MSDC-RI MSDC-RI
Column type CapillaryCapillaryCapillaryCapillaryCapillary
Active phase AT-5BP-1SPB-1HP-5DB-5
Column length (m) 60.50.30.30.30.
Carrier gas He HeliumHe
Substrate
Column diameter (mm) 0.250.220.200.320.32
Phase thickness (μm) 0.250.250.200.250.25
Tstart (C) 60.60.70.60.60.
Tend (C) 200.220.220.246.230.
Heat rate (K/min) 4.2.3.3.3.
Initial hold (min)
Final hold (min) 20.20.15. 15.
I 934.924.922.928.931.
ReferenceBorges, Rojas, et al., 2006Boti, Yao, et al., 2006Cavaleiro, Pinto, et al., 2006Coronel, Cerda-Garcia-Rojas, et al., 2006Damjanovic, Skala, et al., 2006
Comment MSDC-RI MSDC-RI MSDC-RI MSDC-RI MSDC-RI
Column type CapillaryCapillaryCapillaryCapillaryCapillary
Active phase HP-5MSDB-5BP-1HP-5HP-1
Column length (m) 30.30.50.30.50.
Carrier gas  HeliumHeHeHe
Substrate
Column diameter (mm) 0.250.260.220.250.2
Phase thickness (μm) 0.250.250.250.250.33
Tstart (C) 60.60.60.50.60.
Tend (C) 280.290.220.300.250.
Heat rate (K/min) 4.3.2.5.2.
Initial hold (min)    5.
Final hold (min)   20.5.40.
I 932.924.922.926.923.
ReferenceEbrahim Sajjadi and Mehregan, 2006Elfami, Komar, et al., 2006Fanciullino, Tomi, et al., 2006Figuérédo, Cabassu, et al., 2006Filippi, Lanfranchi, et al., 2006
Comment MSDC-RI MSDC-RI MSDC-RI MSDC-RI MSDC-RI
Column type CapillaryCapillaryCapillaryCapillaryCapillary
Active phase DB-5DB-5DB-5CP Sil 5 CBHP-5
Column length (m) 30.30.30.30.30.
Carrier gas HeHeHe He
Substrate
Column diameter (mm) 0.250.250.250.250.25
Phase thickness (μm) 0.250.250.250.250.25
Tstart (C) 60.60.50.40.60.
Tend (C) 240.240.250.220.240.
Heat rate (K/min) 5.5.3.3.4.
Initial hold (min) 2.2.
Final hold (min)   10.3.
I 933.933.929.930.931.
ReferenceGohari, Hadjiakhoondi, et al., 2006Gohari A.R., Hadjiakhoondi A., et al., 2006Havlik, Kokoska, et al., 2006Hymete, Rohloff, et al., 2006Ibañez and Usubillaga, 2006
Comment MSDC-RI MSDC-RI MSDC-RI MSDC-RI MSDC-RI
Column type CapillaryCapillaryCapillaryCapillaryCapillary
Active phase HP-5MSMethyl SiliconeHP-5CP Sil 5 CBCP Sil 5 CB
Column length (m) 30.25.30.30.30.
Carrier gas HeHeHeliumN2N2
Substrate
Column diameter (mm) 0.250.250.320.250.25
Phase thickness (μm) 0.250.250.250.250.25
Tstart (C) 50.90.60.60.50.
Tend (C) 280.220.260.300.200.
Heat rate (K/min) 5.7.5.5.5.
Initial hold (min) 4.2.2.4.
Final hold (min) 10. 13.
I 932.922.928.924.922.
ReferenceKim, El-Aty, et al., 2006Kitchlu, Bakshi, et al., 2006Kucuk, Gulec, et al., 2006Kurowska and Galazka, 2006Martin, Joseph, et al., 2006
Comment MSDC-RI MSDC-RI MSDC-RI MSDC-RI MSDC-RI
Column type CapillaryCapillaryCapillaryCapillaryCapillary
Active phase BP-1DB-5DB-5CP-Sil 5 CBNB-30
Column length (m) 25.30.30.25.30.
Carrier gas HeHeHeHydrogenHe
Substrate
Column diameter (mm) 0.30.250.250.250.2
Phase thickness (μm)  0.250.250.150.25
Tstart (C) 70.60.50.50.50.
Tend (C) 220.220.250.230.250.
Heat rate (K/min) 4.4.4.3.2.
Initial hold (min) 2.
Final hold (min) 10.
I 936.931.928.933.920.
ReferenceMoody, Gundidza, et al., 2006Morteza-Semnani, Akbarzadeh, et al., 2006Najafpour Navaei, Mirza, et al., 2006Olawore, Usman, et al., 2006Orav, Raal, et al., 2006
Comment MSDC-RI MSDC-RI MSDC-RI MSDC-RI MSDC-RI
Column type CapillaryCapillaryCapillaryCapillaryCapillary
Active phase SE-52DB-1DB-5HP-5MSHP-5MS
Column length (m) 50.50.30.30.30.
Carrier gas HeliumN2HydrogenHe
Substrate
Column diameter (mm) 0.250.250.250.250.25
Phase thickness (μm)  0.250.250.250.25
Tstart (C) 50.95.70.60.50.
Tend (C) 240.240.280.280.250.
Heat rate (K/min) 3.4.4.3.10.
Initial hold (min)   4. 5.
Final hold (min)
I 931.927.931.909.927.
ReferenceOzcan, Chalchat, et al., 2006Pala-Paul J., Perez-Alonso M.J., et al., 2006Pino, Marbot, et al., 2006Pitarokili, Tzakou, et al., 2006Robinson, 2006
Comment MSDC-RI MSDC-RI MSDC-RI MSDC-RI MSDC-RI
Column type CapillaryCapillaryCapillaryCapillaryCapillary
Active phase DB-5DB-5ZB-5FSOT-RSL-200DB-5
Column length (m) 30.30.30.30.30.
Carrier gas HeHeHeHydrogenHe
Substrate
Column diameter (mm) 0.250.250.250.320.25
Phase thickness (μm) 0.250.250.250.250.25
Tstart (C) 60.60.40.40.50.
Tend (C) 200.260.300.280.240.
Heat rate (K/min) 2.5.2.6.4.
Initial hold (min)    5.
Final hold (min) 60.  5.
I 934.927.929.930.931.
ReferenceRout, Naik, et al., 2006Sabulal, Dan, et al., 2006Sari M., Biondi D.M., et al., 2006Schmidt, Jirovetz, et al., 2006Sefidkon, Abbasi, et al., 2006
Comment MSDC-RI MSDC-RI MSDC-RI MSDC-RI MSDC-RI
Column type CapillaryCapillaryCapillaryCapillaryCapillary
Active phase DB-5DB-5DB-1DB-5HP-5
Column length (m) 30.30.60.30.25.
Carrier gas HeHeHeHeN2
Substrate
Column diameter (mm) 0.250.250.250.250.2
Phase thickness (μm) 0.250.25 0.250.33
Tstart (C) 50.40.40.40.30.
Tend (C) 240.240.250.260.280.
Heat rate (K/min) 4.4.4.2.3.
Initial hold (min)    5.
Final hold (min)    20.
I 927.930.927.930.930.
ReferenceSefidkon, Abbasi, et al., 2006Sefidkon and Jamzad, 2006Sefidkon, Jamzad, et al., 2006Senatore, Landolfi, et al., 2006Shafi, Jose, et al., 2006
Comment MSDC-RI MSDC-RI MSDC-RI MSDC-RI MSDC-RI
Column type CapillaryCapillaryCapillaryCapillaryCapillary
Active phase CP Sil 5 CBDB-1Methyl SiliconeSPB-5DB-5
Column length (m) 25.30.25.60.30.
Carrier gas   N2HeN2
Substrate
Column diameter (mm) 0.250.320.30.320.25
Phase thickness (μm)  0.250.151.0.25
Tstart (C) 50.60.50.40.60.
Tend (C) 230.230.210.230.240.
Heat rate (K/min) 3.3.2.3.4.
Initial hold (min)  3.5.5.
Final hold (min)  10. 2.
I 928.926.934.934.933.
ReferenceTesso, Kubeczka, et al., 2006Tohar, Mohd, et al., 2006Tonzibo, Coffy, et al., 2006Tornambe, Cornu, et al., 2006Trilles, Bombarda, et al., 2006
Comment MSDC-RI MSDC-RI MSDC-RI MSDC-RI MSDC-RI
Column type CapillaryCapillaryCapillaryCapillaryCapillary
Active phase DB-1SPB-1SPB-1DB-5HP-5MS
Column length (m) 50.50.30.30.30.
Carrier gas N2HeHeHeHe
Substrate
Column diameter (mm) 0.250.20.250.250.25
Phase thickness (μm) 0.250.330.250.250.25
Tstart (C) 90.50.50.40.60.
Tend (C) 240.220.250.250.280.
Heat rate (K/min) 4.4.4.4.3.
Initial hold (min)  1.1.
Final hold (min)  10.10.
I 916.922.933.922.925.
ReferenceVelasco-Negueruela, Pérez-Alonso, et al., 2006Wong, Lim, et al., 2006Wong, Sivasothy, et al., 2006Yadegarinia, Gachkar, et al., 2006Basta, Tzakou, et al., 2005
Comment MSDC-RI MSDC-RI MSDC-RI MSDC-RI MSDC-RI
Column type CapillaryCapillaryCapillaryCapillaryCapillary
Active phase HP-1DB-5MSDB-1DB-5Methyl Silicone
Column length (m) 50.30.25.50.60.
Carrier gas HeHeHe He
Substrate
Column diameter (mm) 0.20.250.250.30.3
Phase thickness (μm) 0.50.250.250.25
Tstart (C) 60.60.50.60.50.
Tend (C) 250.240.250.240.240.
Heat rate (K/min) 2.3.3.2.3.
Initial hold (min)   3.
Final hold (min) 60.
I 922.929.926.930.924.
ReferenceBendimerad and Bendiab, 2005Busman, Zoghbi, et al., 2005Cégiéla-Carlioz, Bessière, et al., 2005Chagonda and Chalchat, 2005Chalchat and Özcan, 2005
Comment MSDC-RI MSDC-RI MSDC-RI MSDC-RI MSDC-RI
Column type CapillaryCapillaryCapillaryCapillaryCapillary
Active phase SPB-5HP-1HP-5RSL-200DB-5
Column length (m) 60.50.30.30.30.
Carrier gas He He He
Substrate
Column diameter (mm) 0.320.20.250.250.25
Phase thickness (μm) 1.0.250.250.250.25
Tstart (C) 40.60.50.40.60.
Tend (C) 230.250.300.280.230.
Heat rate (K/min) 3.2.5.6.3.
Initial hold (min) 5.60.5.2.
Final hold (min)   5.10.
I 934.923.926.930.921.
ReferenceCornu, Kondjoyan, et al., 2005Fernandez, Lizzani-Cuvelier, et al., 2005Figuérédo, Cabassu, et al., 2005Jirovetz, Buchbauer, et al., 2005Limberger, Sobral, et al., 2005
Comment MSDC-RI MSDC-RI MSDC-RI MSDC-RI MSDC-RI
Column type CapillaryCapillaryCapillaryCapillaryCapillary
Active phase DB-5DB-5CP Sil 5 CBDB-5HP-5MS
Column length (m) 30.30.25.30.30.
Carrier gas HeHe He
Substrate
Column diameter (mm) 0.250.250.250.320.2
Phase thickness (μm) 0.250.250.150.25
Tstart (C) 60.60.50.40.60.
Tend (C) 220.220.230.250.280.
Heat rate (K/min) 4.4.3.5.3.
Initial hold (min) 5.4. 0.5
Final hold (min)    2.
I 930.932.933.938.930.
ReferenceMorteza-Semnani, Akbarzadeh, et al., 2005Morteza-Semnani and Saeedi, 2005Ogunwande, Olawore, et al., 2005Özel, Gögüs, et al., 2005Petrakis, Roussis, et al., 2005
Comment MSDC-RI MSDC-RI MSDC-RI MSDC-RI MSDC-RI
Column type CapillaryCapillaryCapillaryCapillaryCapillary
Active phase HP-5MSDB-1CP Sil 5 CBCP Sil 5 CBHP-5
Column length (m) 30.60.30.30.30.
Carrier gas HeHeHeHeHe
Substrate
Column diameter (mm) 0.250.250.250.250.25
Phase thickness (μm) 0.320.250.250.25
Tstart (C) 60.50.40.40.60.
Tend (C) 250.250.220.220.240.
Heat rate (K/min) 5.4.4.4.5.
Initial hold (min) 3. 1.1.
Final hold (min)
I 924.916.930.930.933.
ReferencePourmortazavi, Ghadiri, et al., 2005Rasooli and Owlia, 2005Rohloff and Bones, 2005Rohloff and Bones, 2005Saeidnia, Gohari, et al., 2005
Comment MSDC-RI MSDC-RI MSDC-RI MSDC-RI MSDC-RI
Column type CapillaryCapillaryCapillaryCapillaryCapillary
Active phase HP-5MSHP-5MSHP-5MSDB-1DB-1
Column length (m) 30.30.30.60.30.
Carrier gas HeHeHeHeHe
Substrate
Column diameter (mm) 0.250.250.250.250.25
Phase thickness (μm) 0.250.250.250.250.25
Tstart (C) 60.60.60.60.50.
Tend (C) 280.275.280.250.265.
Heat rate (K/min) 4.4.4.5.2.5
Initial hold (min)     1.
Final hold (min)    10.20.
I 928.929.927.926.921.
ReferenceSajjadi S.E. and Eskandari B., 2005Sajjadi and Ghannadi, 2005Sajjadi, 2005Salehi, Sonboli, et al., 2005Sarkhail, Amin, et al., 2005
Comment MSDC-RI MSDC-RI MSDC-RI MSDC-RI MSDC-RI
Column type CapillaryCapillaryCapillaryCapillaryCapillary
Active phase DB-5DB-5MSDB-5HP-5MSDB-1
Column length (m) 30.30.30.30.60.
Carrier gas HeHeHeHeHe
Substrate
Column diameter (mm) 0.250.250.250.250.25
Phase thickness (μm)  0.250.250.250.25
Tstart (C) 40.60.60.60.60.
Tend (C) 240.240.230.280.250.
Heat rate (K/min) 4.3.3.3.5.
Initial hold (min)
Final hold (min)   20. 10.
I 930.931.930.923.922.
ReferenceSefidkon and Jamzad, 2005da Silva, Andrade, et al., 2005Skoula and Grayer, 2005Slavkovska, Couladis, et al., 2005Sonboli, Salehi, et al., 2005
Comment MSDC-RI MSDC-RI MSDC-RI MSDC-RI MSDC-RI
Column type CapillaryCapillaryCapillaryCapillaryCapillary
Active phase DB-5HP-5MSHP-5MSDB-1HP-5MS
Column length (m) 30.30.30.50.30.
Carrier gas  HeHe
Substrate
Column diameter (mm) 0.250.250.250.250.25
Phase thickness (μm) 0.250.250.250.250.25
Tstart (C) 40.50.60.60.40.
Tend (C) 210.240.280.240.220.
Heat rate (K/min) 2.3.3.3.3.
Initial hold (min) 2.3.  5.
Final hold (min) 33.   10.
I 934.910.909.913.923.
ReferenceStevanovic, Garneau, et al., 2005Tepe B., Sokmen M., et al., 2005Tzakou, Bazos, et al., 2005Velasco-Negueruela, Pérez-Alonso, et al., 2005Vichi, Riu-Aumatell, et al., 2005
Comment MSDC-RI MSDC-RI MSDC-RI MSDC-RI MSDC-RI
Column type CapillaryCapillaryCapillaryCapillaryCapillary
Active phase SPB-1CP Sil 5 CBDB-5HP-5 MSHP-5MS
Column length (m) 50.30.30.30.30.
Carrier gas HeN2HeHeliumHe
Substrate
Column diameter (mm) 0.20.250.250.250.25
Phase thickness (μm) 0.330.250.250.250.25
Tstart (C) 50.50.90.60.60.
Tend (C) 220.200.220.275.275.
Heat rate (K/min) 4.5.7.4.4.
Initial hold (min) 3. 2.
Final hold (min) 30. 5.
I 926.921.923.927.924.
ReferenceWong, Lee, et al., 2005Agnaniet, Menut, et al., 2004Agnihotri, Thappa, et al., 2004Ghannadi, Sajjadi, et al., 2004Hajhashemi V., Ghannadi A., et al., 2004
Comment MSDC-RI MSDC-RI MSDC-RI MSDC-RI MSDC-RI
Column type CapillaryCapillaryCapillaryCapillaryCapillary
Active phase DB-1DB-5ZB-5DB-5RTX-1
Column length (m) 25.25.60.60.30.
Carrier gas  NitrogenHeHeN2
Substrate
Column diameter (mm) 0.250.250.250.250.25
Phase thickness (μm) 0.250.250.250.250.25
Tstart (C) 60.60.40.40.60.
Tend (C) 180.240.260.280.300.
Heat rate (K/min) 3.3.6.4.4.
Initial hold (min) 10. 4.64.
Final hold (min) 10. 1.
I 931.928.934.926.926.
Referencebin Jantan, Ayop, et al., 2004JAvidnia, Mojab, et al., 2004Jürgens and Dötterl, 2004Kalvandi, Sefidkon, et al., 2004Kalemba and Thiem, 2004
Comment MSDC-RI MSDC-RI MSDC-RI MSDC-RI MSDC-RI
Column type CapillaryCapillaryCapillaryCapillaryCapillary
Active phase SE-54HP-5MSRTX-1DB-5NB-30
Column length (m) 30.30.30.30.50.
Carrier gas HeHeN2 He
Substrate
Column diameter (mm) 0.250.250.320.250.2
Phase thickness (μm) 0.250.250.250.250.25
Tstart (C) 60.50.60.40.50.
Tend (C) 260.230.300.210.250.
Heat rate (K/min) 2.5.4.2.2.
Initial hold (min) 5.2. 2.
Final hold (min)  10. 33.
I 928.908.916.934.923.
ReferenceKilic, Hafizoglu, et al., 2004Li and Jiang, 2004Lis, Boczek, et al., 2004Lopez Arze, Collin, et al., 2004Orav, Stulova, et al., 2004
Comment MSDC-RI MSDC-RI MSDC-RI MSDC-RI MSDC-RI
Column type CapillaryCapillaryCapillaryCapillaryCapillary
Active phase NB-30DB-1DB-1NB-30DB-1
Column length (m) 50.50.50.50.60.
Carrier gas HeHeN2HeHe
Substrate
Column diameter (mm) 0.20.220.250.20.25
Phase thickness (μm) 0.250.250.250.250.25
Tstart (C) 50.70.95.50.50.
Tend (C) 250.220.240.250.250.
Heat rate (K/min) 2.4.4.2.4.
Initial hold (min)
Final hold (min)
I 923.926.918.924.916.
ReferenceOrav, Stulova, et al., 2004Palá-Paúl, García-Jiménez, et al., 2004Palá-Paúl, Velasco-Negueruela, et al., 2004Raal, Arak, et al., 2004Rasooli and Razzaghi Abyaneh, 2004
Comment MSDC-RI MSDC-RI MSDC-RI MSDC-RI MSDC-RI
Column type CapillaryCapillaryCapillaryCapillaryCapillary
Active phase DB-5Methyl SiliconeHP-5 MSHP-5MSHP-5MS
Column length (m) 30.60.30.30.30.
Carrier gas HeHeHeliumHeHe
Substrate
Column diameter (mm) 0.250.250.250.250.25
Phase thickness (μm) 0.250.250.250.250.25
Tstart (C) 35.60.60.60.60.
Tend (C) 220.200.200.280.280.
Heat rate (K/min) 2.54.4.4.4.
Initial hold (min)  1.1.
Final hold (min) 6.20.20.
I 930.920.920.925.929.
ReferenceRohloff, Mordal, et al., 2004Rojas, Usubillaga, et al., 2004Royas, Usubillaga, et al., 2004Sadeghpour, Asghari, et al., 2004Sajjadi and Shahpiri, 2004
Comment MSDC-RI MSDC-RI MSDC-RI MSDC-RI MSDC-RI
Column type CapillaryCapillaryCapillaryCapillaryCapillary
Active phase DB-1DB-5HP-1HP-5HP-5
Column length (m) 30.30.30.25.25.
Carrier gas He HeN2H2
Substrate
Column diameter (mm) 0.250.250.250.20.32
Phase thickness (μm) 0.250.250.330.50.52
Tstart (C) 50.50.40.30.40.
Tend (C) 265.250.260.280.240.
Heat rate (K/min) 2.53.2.3.4.
Initial hold (min) 1.5.5.
Final hold (min) 20. 20.
I 921.930.924.930.931.
ReferenceSarkhail, Amin, et al., 2004Sefidkon, Jamzad, et al., 2004Senatore, Napolitano, et al., 2004Shafi, Nambiar, et al., 2004Simic, Sokovic, et al., 2004
Comment MSDC-RI MSDC-RI MSDC-RI MSDC-RI MSDC-RI
Column type CapillaryCapillaryCapillaryCapillaryCapillary
Active phase DB-5CP Sil 5 CBBPX-5CP Sil 8 CBDB-5
Column length (m) 30.20.25.30.30.
Carrier gas HeHeHe He
Substrate
Column diameter (mm) 0.250.250.220.320.249
Phase thickness (μm) 0.250.251.0.250.25
Tstart (C) 60.100.60.50.60.
Tend (C) 240.270.250.200.300.
Heat rate (K/min) 3.8.3.5.3.
Initial hold (min)  2.5.5.
Final hold (min)   10.
I 927.921.933.929.925.
ReferenceTellez, Khan, et al., 2004Thappa, Bakshi, et al., 2004Vilaseca, Guy, et al., 2004Wang, Guo, et al., 2004Woerdenbag, Windono, et al., 2004
Comment MSDC-RI MSDC-RI MSDC-RI MSDC-RI MSDC-RI
Column type CapillaryCapillaryCapillaryCapillaryCapillary
Active phase HP-5MSHP-5DB-1RTX-5SilDB-1
Column length (m) 30.30.60.30.60.
Carrier gas HeN2HeHeHe
Substrate
Column diameter (mm) 0.250.250.250.250.25
Phase thickness (μm) 0.250.25 0.250.25
Tstart (C) 60.60.50.70.50.
Tend (C) 275.220.250.200.250.
Heat rate (K/min) 4.5.4.4.4.
Initial hold (min)  10.
Final hold (min)    10.
I 930.938.936.927.933.
ReferenceAfsharypuor and Jahromy, 2003Bertoli, Menichini, et al., 2003Dabiri and Sefidkon, 2003Dudai, Larkov, et al., 2003Ebrahimzadeh, Yamini, et al., 2003
Comment MSDC-RI MSDC-RI MSDC-RI MSDC-RI MSDC-RI
Column type CapillaryCapillaryCapillaryCapillaryCapillary
Active phase DB-5DB-5HP-5MSDB-1HP-5MS
Column length (m) 60.60.30.30.30.
Carrier gas HeHeHeN2He
Substrate
Column diameter (mm) 0.320.320.250.250.25
Phase thickness (μm)   0.250.250.25
Tstart (C) 50.50.60.50.60.
Tend (C) 220.200.220.200.280.
Heat rate (K/min) 3.3.5.5.4.
Initial hold (min)   20.
Final hold (min)   20.
I 926.926.936.913.931.
ReferenceEdris and Farrag, 2003Edris, Shalaby, et al., 2003Feizbaksh, Saber Tehrani, et al., 2003Fekam Boyom, Ngouana, et al., 2003Ghasemi, Asghari, et al., 2003
Comment MSDC-RI MSDC-RI MSDC-RI MSDC-RI MSDC-RI
Column type CapillaryCapillaryCapillaryCapillaryCapillary
Active phase HP-5MSRSL-200RSL-200DB-5SE-30
Column length (m) 30.30.30.50.12.
Carrier gas HeH2H2HeHe
Substrate
Column diameter (mm) 0.250.320.320.20.22
Phase thickness (μm) 0.250.250.250.250.3
Tstart (C) 60.40.40.50.70.
Tend (C) 275.280.280.220.220.
Heat rate (K/min) 4.6.6.3.3.
Initial hold (min)  5.5.2.
Final hold (min)  5.5.10.
I 927.927.927.917.920.
ReferenceHajhashemi, Ghannadi, et al., 2003Jirovetz, Buchbauer, et al., 2003Jirovetz, Buchbauer, et al., 2003, 2Juteau, Jerkovic, et al., 2003Kambouche and El-Abed, 2003
Comment MSDC-RI MSDC-RI MSDC-RI MSDC-RI MSDC-RI
Column type CapillaryCapillaryCapillaryCapillaryCapillary
Active phase CP Sil 5 CBDB-5MSDB-5CP Sil 5 CBZB-1
Column length (m) 25.30.50.25.30.
Carrier gas HeHeHe N2
Substrate
Column diameter (mm) 0.250.250.20.250.25
Phase thickness (μm) 0.250.250.250.390.25
Tstart (C) 35.60.50.60.45.
Tend (C) 280.240.220.220.230.
Heat rate (K/min) 5.3.3.5.3.
Initial hold (min) 2.5 2.
Final hold (min)
I 921.928.928.926.922.
ReferenceKanjilal, Kotoky, et al., 2003Maia, Taveira, et al., 2003Masotti, Juteau, et al., 2003Mazloomifar, Saber-Tehrani, et al., 2003Mierendorff, Stahl-Biskup, et al., 2003
Comment MSDC-RI MSDC-RI MSDC-RI MSDC-RI MSDC-RI
Column type CapillaryCapillaryCapillaryCapillaryCapillary
Active phase HP-5OV-101CP Sil 5 CBDB-1DB-5
Column length (m) 30.50.25.50.30.
Carrier gas HeliumHeH2N2H2
Substrate
Column diameter (mm) 0.320.20.250.250.25
Phase thickness (μm)  0.50.150.250.25
Tstart (C) 70.50.50.95.60.
Tend (C) 210.250.230.240.280.
Heat rate (K/min) 2.2.3.4.4.
Initial hold (min)     10.
Final hold (min) 60.   40.
I 930.921.925.936.931.
ReferenceMookdasanit, Tamura, et al., 2003Orav, Kailas, et al., 2003Oyedeji, Ekundayo, et al., 2003Perez-Alonso, Velasco-Negueruela, et al., 2003Pino, Marbot, et al., 2003
Comment MSDC-RI MSDC-RI MSDC-RI MSDC-RI MSDC-RI
Column type CapillaryCapillaryCapillaryCapillaryCapillary
Active phase HP-5DB-1DB-1HP-5DB-1
Column length (m) 30.60.60.30.60.
Carrier gas HeHeHeHeHe
Substrate
Column diameter (mm) 0.250.250.250.250.25
Phase thickness (μm) 0.250.250.250.250.25
Tstart (C) 60.40.40.60.40.
Tend (C) 280.220.220.280.260.
Heat rate (K/min) 3.4.4.4.4.
Initial hold (min)     5.
Final hold (min)
I 909.923.923.930.935.
ReferencePitarokili, Tzakou, et al., 2003Rasooli and Mirmostafa, 2003Rasooli and Mirmostafa, 2003Sajjadi and Mehregan, 2003Sefidkon, Naderi Nik, et al., 2003
Comment MSDC-RI MSDC-RI MSDC-RI MSDC-RI MSDC-RI
Column type CapillaryCapillaryCapillaryCapillaryCapillary
Active phase DB-1HP-5CP Sil 5 CBDB-1HP-5
Column length (m) 60.60.25.50.25.
Carrier gas He  N2Helium
Substrate
Column diameter (mm) 0.250.250.250.250.32
Phase thickness (μm) 0.250.250.150.250.53
Tstart (C) 50.40.50.90.40.
Tend (C) 280.250.230.240.280.
Heat rate (K/min) 4.5.3.4.4.
Initial hold (min)  15.
Final hold (min)
I 935.928.927.903.922.
ReferenceShahmir, Ahmadi, et al., 2003Stashenko, Jaramillo, et al., 2003Taiwo and Bolanle, 2003Velasco-Negueruela, Pérez-Alonso, et al., 2003Velickovic, Ristic, et al., 2003
Comment MSDC-RI MSDC-RI MSDC-RI MSDC-RI MSDC-RI
Column type CapillaryCapillaryCapillaryCapillaryCapillary
Active phase HP-5HP-5HP-5DB-5DB-1
Column length (m) 25.25.30.25.60.
Carrier gas HeliumHeliumHeN2He
Substrate
Column diameter (mm) 0.320.320.250.250.25
Phase thickness (μm) 0.530.530.320.250.25
Tstart (C) 40.40.60.50.60.
Tend (C) 280.280.250.250.220.
Heat rate (K/min) 4.4.5.4.4.
Initial hold (min)   30.
Final hold (min)    10.
I 928.930.937.928.936.
ReferenceVelickovic, Ristic, et al., 2003Velickovic, Ristic, et al., 2003Yassa, Akhani, et al., 2003Zrira, Elamrani, et al., 2003Baher, Mirza, et al., 2002
Comment MSDC-RI MSDC-RI MSDC-RI MSDC-RI MSDC-RI
Column type CapillaryCapillaryCapillaryCapillaryCapillary
Active phase DB-5OV-101DB-5HP-15 % Phenyl methyl siloxane
Column length (m) 30.25.30.30.30.
Carrier gas He HeHeHe
Substrate
Column diameter (mm) 0.2490.320.250.250.25
Phase thickness (μm) 0.25 0.250.250.25
Tstart (C) 60.50.60.70.75.
Tend (C) 300.200.280.220.200.
Heat rate (K/min) 3.5.3.3.3.
Initial hold (min)     4.
Final hold (min) 5. 30.15.8.
I 925.925.924.922.930.
ReferenceBos, Koulman, et al., 2002Boyom, Keumedjio, et al., 2002Caredda, Marongiu, et al., 2002Cavaleiro, Salgueiro, et al., 2002Cicció and Gómez-Laurito, 2002
Comment MSDC-RI MSDC-RI MSDC-RI MSDC-RI MSDC-RI
Column type CapillaryCapillaryCapillaryCapillaryCapillary
Active phase DB-1DB-5HP-5DB-1SE-30
Column length (m) 60.30.30.30.50.
Carrier gas HeN2N2H2He
Substrate
Column diameter (mm) 0.320.250.250.320.25
Phase thickness (μm) 0.250.250.250.250.25
Tstart (C) 50.50.50.40.70.
Tend (C) 200.250.250.245.240.
Heat rate (K/min) 3.4.4.3.4.
Initial hold (min) 6. 5.20.
Final hold (min)
I 921.931.930.914.934.
ReferenceCimanga, Apers, et al., 2002Farah, Fechtal, et al., 2002Farah, Fechtal. M., et al., 2002Gancel, Ollé, et al., 2002Iñigo, Palá-Paúl, et al., 2002
Comment MSDC-RI MSDC-RI MSDC-RI MSDC-RI MSDC-RI
Column type CapillaryCapillaryCapillaryCapillaryCapillary
Active phase RSL-200DB-1SPB-5DB-5DB-5MS
Column length (m) 30.25.60.30.30.
Carrier gas H2HeHeHeHe
Substrate
Column diameter (mm) 0.320.230.250.250.25
Phase thickness (μm) 0.250.200.250.250.25
Tstart (C) 40.50.50.60.60.
Tend (C) 280.200.240.240.240.
Heat rate (K/min) 6.3.5.3.3.
Initial hold (min) 5.3.3.
Final hold (min) 5.30.10.
I 938.934.931.931.928.
ReferenceJirovetz, Buchbauer, et al., 2002Khallouki, Younos, et al., 2002Kim and Lee, 2002Kobaisy, Tellez, et al., 2002Maia, Zoghbi, et al., 2002
Comment MSDC-RI MSDC-RI MSDC-RI MSDC-RI MSDC-RI
Column type CapillaryCapillaryCapillaryCapillaryCapillary
Active phase OV-101HP-5HP-5OV-101DB-5MS
Column length (m) 25.30.30.50.30.
Carrier gas He  HeHe
Substrate
Column diameter (mm) 0.320.250.250.20.32
Phase thickness (μm)  0.250.250.50.25
Tstart (C) 50.60.60.50.40.
Tend (C) 200.240.240.250.280.
Heat rate (K/min) 5.3.3.2.4.
Initial hold (min)
Final hold (min)     5.
I 920.931.932.923.937.
ReferenceMenut, Bessière, et al., 2002Novak, Langbehn, et al., 2002Novak, Langbehn, et al., 2002Orav, Kailas, et al., 2002Phutdhawong, Korth, et al., 2002
Comment MSDC-RI MSDC-RI MSDC-RI MSDC-RI MSDC-RI
Column type CapillaryCapillaryCapillaryCapillaryCapillary
Active phase SPB-5DB-1DB-1DB-1DB-5MS
Column length (m) 30.60.60.50.30.
Carrier gas HeliumHeHeN2He
Substrate
Column diameter (mm) 0.250.250.250.250.25
Phase thickness (μm) 0.25 0.250.250.25
Tstart (C) 60.40.40.60.60.
Tend (C) 250.250.280.240.270.
Heat rate (K/min) 4.4.4.3.3.
Initial hold (min) 2. 5.
Final hold (min) 20.
I 931.934.936.913.928.
ReferencePino, Marbot, et al., 2002Sefidkon, Dabiri, et al., 2002Sefidkon, 2002Velasco-Negueruela, Pérez-Alonso, et al., 2002Zoghbi, Andrade, et al., 2002
Comment MSDC-RI MSDC-RI MSDC-RI MSDC-RI MSDC-RI
Column type CapillaryCapillaryCapillaryCapillaryCapillary
Active phase SPB-5DB-1DB-1DB-5MSOV-1
Column length (m) 60.60.60.60.30.
Carrier gas HeHeHeHeH2
Substrate
Column diameter (mm) 0.320.250.250.250.32
Phase thickness (μm)  0.250.250.250.3
Tstart (C) 40.40.40.35.50.
Tend (C) 220.280.280.250.250.
Heat rate (K/min) 3.4.4.3.3.
Initial hold (min) 5.5.5.5.1.
Final hold (min) 15.   20.
I 934.921.922.930.923.
ReferenceCornu, Carnat, et al., 2001Dabiri and Sefidkon, 2001Dabiri and Sefidkon, 2001Fernando and Grün, 2001Gallori, Bilia, et al., 2001
Comment MSDC-RI MSDC-RI MSDC-RI MSDC-RI MSDC-RI
Column type CapillaryCapillaryCapillaryCapillaryCapillary
Active phase HP-5RTX-1BP-1CBP-1DB-1
Column length (m) 30.30.50.25.60.
Carrier gas N2N2HeNitrogenHe
Substrate
Column diameter (mm) 0.250.250.220.250.25
Phase thickness (μm) 0.250.250.250.250.25
Tstart (C) 60.60.60.50.50.
Tend (C) 220.300.230.210.270.
Heat rate (K/min) 5.4.2.3.4.
Initial hold (min) 10.  2.
Final hold (min)   35.
I 932.928.922.922.935.
ReferenceGallori, Flamini, et al., 2001Kalemba, Marschall, et al., 2001Lota, de Rocca Serra, et al., 2001Ly, Yamauchi, et al., 2001Mirza, Ahmadi, et al., 2001
Comment MSDC-RI MSDC-RI MSDC-RI MSDC-RI MSDC-RI
Column type CapillaryCapillaryCapillaryCapillaryCapillary
Active phase OV-101DB-1DB-5DB-5CP Sil 5 CB
Column length (m) 50.30.60.30.25.
Carrier gas HeN2HeH2He
Substrate
Column diameter (mm) 0.20.250.250.250.25
Phase thickness (μm)  0.25 0.250.39
Tstart (C) 50.80.50.60.60.
Tend (C) 250.225.250.285.220.
Heat rate (K/min) 2.4.3.3.5.
Initial hold (min)   5.
Final hold (min)
I 921.917.931.924.926.
ReferenceOrav and Kann, 2001Palá-Paúl, Pérez-Alonso, et al., 2001Rousis, Papadogianni, et al., 2001Santos-Gomes and Fernandes-Ferreira, 2001Sayyah, Kamalinejad, et al., 2001
Comment MSDC-RI MSDC-RI MSDC-RI MSDC-RI MSDC-RI
Column type CapillaryCapillaryCapillaryCapillaryCapillary
Active phase CP-Sil 5 CBDB-5OV-101OV-101CP Sil 5 CB
Column length (m) 25.30.50.50.25.
Carrier gas NitrogenHeN2N2
Substrate
Column diameter (mm) 0.250.250.250.250.25
Phase thickness (μm) 0.390.25  0.15
Tstart (C) 60.60.80.80.50.
Tend (C) 220.240.200.200.230.
Heat rate (K/min) 5.3.2.2.3.
Initial hold (min)
Final hold (min)
I 926.931.929.929.925.
ReferenceSayyah, Kamalinejad, et al., 2001, 2Tellez M., Estell R., et al., 2001Yang, 2001Yang, 2001, 2Asekun and Ekundayo, 2000
Comment MSDC-RI MSDC-RI MSDC-RI MSDC-RI MSDC-RI
Column type CapillaryCapillaryCapillaryCapillaryCapillary
Active phase DB-1RSL-200HP-5DB-5DB-1
Column length (m) 60.60.30.30.25.
Carrier gas N2H2HeHeNitrogen
Substrate
Column diameter (mm) 0.250.320.250.250.50
Phase thickness (μm) 0.250.25 0.250.25
Tstart (C) 60.40.80.60.60.
Tend (C) 220.250.200.240.220.
Heat rate (K/min) 3.6.9.3.5.
Initial hold (min) 5.
Final hold (min) 22. 10.
I 932.935.921.929.925.
ReferenceBailac, Dellacasa, et al., 2000Jirovetz, Puschmann, et al., 2000Lis-Balchin and Roth, 2000Maia, Zoghbi, et al., 2000Mallavarapu, Rao, et al., 2000
Comment MSDC-RI MSDC-RI MSDC-RI MSDC-RI MSDC-RI
Column type CapillaryCapillaryCapillaryCapillaryCapillary
Active phase DB-5BP-1HP-5DB-1DB-5
Column length (m) 30.25.30.30.30.
Carrier gas N2N2HeHeHe
Substrate
Column diameter (mm) 0.220.330.250.250.25
Phase thickness (μm) 0.251.00.250.250.25
Tstart (C) 70.60.60.40.60.
Tend (C) 230.275.275.260.240.
Heat rate (K/min) 4.4.4.2.3.
Initial hold (min) 2.  5.
Final hold (min) 20.  2.
I 928.928.929.927.932.
ReferenceMitiku, Sawamura, et al., 2000Mohagheghzadeh, Shams-Ardakani, et al., 2000Mohagheghzadeh, Shams-Ardakani, et al., 2000, 2Senatore, Napolitano, et al., 2000Tellez, Dayan, et al., 2000
Comment MSDC-RI MSDC-RI MSDC-RI MSDC-RI MSDC-RI
Column type CapillaryCapillaryCapillaryCapillaryCapillary
Active phase SPB-1OV-101DB-1DB-5MSRTX-1
Column length (m) 50.52.60.25.30.
Carrier gas  HeliumHeHeN2
Substrate
Column diameter (mm) 0.20.260.250.250.25
Phase thickness (μm) 0.330.130.250.250.25
Tstart (C) 60.50.50.55.60.
Tend (C) 260.220.230.350.300.
Heat rate (K/min) 4.3.4.4.4.
Initial hold (min)  0. 5.
Final hold (min)  0.
I 921.923.930.941.926.
ReferenceChoo, Wong, et al., 1999Dzumayev, Tkachenko, et al., 1999Eikani, Goodarznia, et al., 1999Griffiths, Robertson, et al., 1999Kalemba, 1999
Comment MSDC-RI MSDC-RI MSDC-RI MSDC-RI MSDC-RI
Column type CapillaryCapillaryCapillaryCapillaryCapillary
Active phase DB-1OV-101DB-5OV-1CP Sil 5 CB
Column length (m) 25.50.30.25.25.
Carrier gas HeN2 H2He
Substrate
Column diameter (mm) 0.250.20.320.250.25
Phase thickness (μm) 0.25 1.0.25
Tstart (C) 50.80.40.40.50.
Tend (C) 290.200.200.220.230.
Heat rate (K/min) 4.1.3.3.3.
Initial hold (min)   5.5.
Final hold (min)  20. 5.
I 925.935.928.922.934.
ReferenceKoulman, 1999Menon, Chacko, et al., 1999Meynier, Novelli, et al., 1999Oberhofer, Nikiforov, et al., 1999Oyedeji, Olawore, et al., 1999
Comment MSDC-RI MSDC-RI MSDC-RI MSDC-RI MSDC-RI
Column type CapillaryCapillaryCapillaryCapillaryCapillary
Active phase DB-1OV-101SE-30BP-1CP Sil 5 CB
Column length (m) 50.50.30.25.25.
Carrier gas HeHeHeliumN2He
Substrate
Column diameter (mm) 0.250.250.250.50.25
Phase thickness (μm) 0.250.250.20 0.39
Tstart (C) 70.70.60.60.60.
Tend (C) 240.220.200.220.220.
Heat rate (K/min) 4.2.3.5.5.
Initial hold (min)  5.4. 5.
Final hold (min)    10.20.
I 917.912.925.925.927.
ReferencePalá-Paúl, Pérez-Alonso, et al., 1999Pateira, Nogueira, et al., 1999Prikhod'ko, Klyuev, et al., 1999Rao, Bhattacharya, et al., 1999Rustaiyan, Masoudi, et al., 1999
Comment MSDC-RI MSDC-RI MSDC-RI MSDC-RI MSDC-RI
Column type CapillaryCapillaryCapillaryCapillaryCapillary
Active phase CP Sil 5 CBDB-1DB-5DB-1DB-1
Column length (m) 25.60.30.60.60.
Carrier gas N2HeHeHeHe
Substrate
Column diameter (mm) 0.250.250.250.250.32
Phase thickness (μm) 0.390.250.250.25
Tstart (C) 60.40.40.50.60.
Tend (C) 220.280.220.220.230.
Heat rate (K/min) 5.4.4.4.3.
Initial hold (min)  5.5.
Final hold (min)     5.
I 926.924.923.931.926.
ReferenceRustaiyan and Nadji, 1999Sefidkon, Dabiri, et al., 1999Sefidkon and Khajavi, 1999Sefidkon and Mirza, 1999Shafiee, Javidnia, et al., 1999
Comment MSDC-RI MSDC-RI MSDC-RI MSDC-RI MSDC-RI
Column type CapillaryCapillaryCapillaryCapillaryCapillary
Active phase DB-5SPB-5CP Sil 5 CBOV-101DB-5MS
Column length (m) 30.60.25.25.30.
Carrier gas HeHeN2HeHe
Substrate
Column diameter (mm) 0.250.32 0.200.25
Phase thickness (μm) 0.251.0.39 0.25
Tstart (C) 60.40.60.80.60.
Tend (C) 240.200.220.240.240.
Heat rate (K/min) 3.3.5.6.3.
Initial hold (min)  5.
Final hold (min)  2.
I 931.933.928.921.929.
ReferenceTellez, Canel, et al., 1999Viallon C., Verdier-Metz I., et al., 1999Weyerstahl, Marschall, et al., 1999Zenkevich, Kosman, et al., 1999Zoghbi, Andrade, et al., 1999
Comment MSDC-RI MSDC-RI MSDC-RI MSDC-RI MSDC-RI
Column type CapillaryCapillaryCapillaryCapillaryCapillary
Active phase SPB-5SE-30HP-5HP-1OV-101
Column length (m) 50.25.25.60.25.
Carrier gas HeHeHeHe
Substrate
Column diameter (mm) 0.320.20.20.250.32
Phase thickness (μm) 0.25 0.330.25
Tstart (C) 60.60.70.50.50.
Tend (C) 240.180.290.280.200.
Heat rate (K/min) 3.3.3.4.5.
Initial hold (min)  10.8.5.
Final hold (min) 20. 20.
I 928.926.934.927.930.
ReferenceDoneanu and Anitescu, 1998Jantan, Ahmad, et al., 1998Poiana, Sicari, et al., 1998Stashenko, Cervantes, et al., 1998Zollo, Biyiti, et al., 1998
Comment MSDC-RI MSDC-RI MSDC-RI MSDC-RI MSDC-RI
Column type CapillaryCapillaryCapillaryCapillaryCapillary
Active phase SPB-SulfurSPB-SulfurDB-1DB-5DB-5
Column length (m) 30.30. 30.30.
Carrier gas HeHe HeliumHe
Substrate
Column diameter (mm) 0.320.32 0.250.25
Phase thickness (μm) 4.4. 0.25
Tstart (C) 45.45.80.60.60.
Tend (C) 240.240.220.240.240.
Heat rate (K/min) 5.5.6.3.4.
Initial hold (min) 13.13.
Final hold (min) 5.5.
I 934.934.924.931.931.
ReferenceMariaca, Berger, et al., 1997Mariaca, Berger, et al., 1997Salgueiro, Vila, et al., 1997Tellez, Estell, et al., 1997Zunino, Novillo-Newton, et al., 1997
Comment MSDC-RI MSDC-RI MSDC-RI MSDC-RI MSDC-RI
Column type CapillaryCapillaryCapillaryCapillaryCapillary
Active phase HP-1OV-101OV-101DB-5DB-1
Column length (m) 23.50.50.30.60.
Carrier gas HeN2He He
Substrate
Column diameter (mm) 0.320.250.250.250.25
Phase thickness (μm) 0.170.17  0.25
Tstart (C) 60.50.50.40.50.
Tend (C) 250.220.250.210.250.
Heat rate (K/min) 5.5.2.2.2.5
Initial hold (min) 3.  2.5.
Final hold (min) 30.  33.
I 921.933.922.934.927.
ReferenceAyedoun, Adeoti, et al., 1996Chacko, Jayalekshmy, et al., 1996Orav, Kailas, et al., 1996Sohounhloue, Dangou, et al., 1996Stashenko, Puertas, et al., 1996
Comment MSDC-RI MSDC-RI MSDC-RI MSDC-RI MSDC-RI
Column type CapillaryCapillaryCapillaryCapillaryCapillary
Active phase SPB-1DB-1DB-1OV-1HP-101
Column length (m) 50.60.60.50.50.
Carrier gas HeHeHeN2H2
Substrate
Column diameter (mm) 0.20.250.250.270.32
Phase thickness (μm) 0.330.250.250.20.3
Tstart (C) 40.70.70.80.65.
Tend (C) 200.270.270.240.300.
Heat rate (K/min) 3.2.52.53.2.
Initial hold (min) 3.5.5. 5.
Final hold (min) 30.
I 923.924.924.923.921.
ReferenceWong and Lai, 1996Tirado, Stashenko, et al., 1995Tirado, Stashenko, et al., 1995Ramanoelina, Viano, et al., 1994Demarne and van der Walt, 1993
Comment MSDC-RI MSDC-RI MSDC-RI MSDC-RI MSDC-RI
Column type CapillaryCapillaryCapillaryCapillaryCapillary
Active phase Methyl SiliconeMethyl SiliconeCP Sil 5 CBMethyl SiliconeSE-54
Column length (m) 50.50.25.25.30.
Carrier gas N2N2  Hydrogen
Substrate
Column diameter (mm) 0.250.250.250.500.25
Phase thickness (μm) 0.170.17  0.25
Tstart (C) 80.80.60.60.60.
Tend (C) 200.200.280.220.250.
Heat rate (K/min) 2.3.5.5.2.
Initial hold (min)     5.
Final hold (min)     2.
I 938.931.927.928.927.
ReferenceGopalakrishnan, Menon, et al., 1993Gopalakrishnan, Menon, et al., 1993Kaul, Singh, et al., 1993Mallavarapu, Ramesh, et al., 1993Kollmannsberger, Nitz, et al., 1992
Comment MSDC-RI MSDC-RI MSDC-RI MSDC-RI MSDC-RI
Column type CapillaryCapillaryCapillaryCapillaryCapillary
Active phase DB-1OV-101OV-101BP-1OV-101
Column length (m) 30.50.50.50.50.
Carrier gas N2N2N2H2N2
Substrate
Column diameter (mm)  0.250.250.300.25
Phase thickness (μm)
Tstart (C) 80.80.80.40.80.
Tend (C) 220.200.200.250.200.
Heat rate (K/min) 4.2.2.10.2.
Initial hold (min)    1.
Final hold (min)
I 920.929.930.926.931.
ReferenceVelasco-Negueruela, Pérez Alonso, et al., 1991Yang and Sugisawa, 1990Yang and Sugisawa, 1990Brophy, Davies, et al., 1989Sugisawa, Yang, et al., 1989
Comment MSDC-RI MSDC-RI MSDC-RI MSDC-RI MSDC-RI
Column type CapillaryCapillaryCapillaryCapillaryCapillary
Active phase OV-101OV-1OV-101OV-101OV-1
Column length (m) 50.60.50.50.40.
Carrier gas N2Helium  He
Substrate
Column diameter (mm) 0.250.500.300.300.5
Phase thickness (μm)  1.2  0.75
Tstart (C) 80.40.40.40.30.
Tend (C) 200.220.230.230.220.
Heat rate (K/min) 2.2.3.53.53.
Initial hold (min)   5.5.
Final hold (min)
I 938.921.924.930.921.
ReferenceSugisawa, Yang, et al., 1989Wahab, Aboutabl, et al., 1987Nykanen, 1986Nykanen, 1986de Pooter, de Buyck, et al., 1986
Comment MSDC-RI MSDC-RI MSDC-RI MSDC-RI MSDC-RI
Column type CapillaryCapillaryCapillary
Active phase OV-1OV-101OV-101
Column length (m)  30.30.
Carrier gas HeHeHe
Substrate
Column diameter (mm)  0.50.5
Phase thickness (μm)  0.80.8
Tstart (C) 40.40.40.
Tend (C) 220.220.220.
Heat rate (K/min) 2.2.2.
Initial hold (min)
Final hold (min)
I 921.921.921.
ReferenceDe Pooter, De Buyck, et al., 1986De Pooter and Schamp, 1986De Pooter and Schamp, 1986
Comment MSDC-RI MSDC-RI MSDC-RI

Van Den Dool and Kratz RI, non-polar column, temperature ramp

Data compiled by: NIST Mass Spectrometry Data Center, William E. Wallace, director

Column type CapillaryCapillaryCapillaryCapillaryCapillary
Active phase RTX-1Equity-5MSHP-5MSHP-5CP-Sil PONA GB
Column length (m) 60.30.30.30.100.
Carrier gas HeHeHeHeHe
Substrate
Column diameter (mm) 0.220.250.250.250.25
Phase thickness (μm) 0.250.250.250.250.25
Tstart (C) 60.50.60.40.140.
Tend (C) 230.250.250.250.230.
Heat rate (K/min) 2.3.2.5.5.
Initial hold (min)   8.1.10.
Final hold (min) 30.10.30.10.25.
I 928.925.926.934.929.
ReferenceBendahou, Muselli, et al., 2008Belsito E.L., Carbone C., et al., 2007Benkaci-Ali, Baaliouamer, et al., 2007Benzo, Gilardoni, et al., 2007Cunicao, Lopes, et al., 2007
Comment MSDC-RI MSDC-RI MSDC-RI MSDC-RI MSDC-RI
Column type CapillaryCapillaryCapillaryCapillaryCapillary
Active phase HP-5DB-5HP-5HP-5DB-5
Column length (m) 25.30.30.30.30.
Carrier gas HeHeN2N2He
Substrate
Column diameter (mm) 0.250.250.250.250.25
Phase thickness (μm) 0.250.250.250.250.25
Tstart (C) 60.60.50.60.60.
Tend (C) 240.240.220.220.246.
Heat rate (K/min) 4.3.5.5.3.
Initial hold (min) 2. 10.10.
Final hold (min)
I 933.932.932.933.926.
ReferenceDehghan, Solaimanian, et al., 2007Flamini, Cioni, et al., 2007Flamini, Tebano, et al., 2007Flamini, Tebano, et al., 2007, 2Hongratanaworakit and Buchbauer, 2007
Comment MSDC-RI MSDC-RI MSDC-RI MSDC-RI MSDC-RI
Column type CapillaryCapillaryCapillaryCapillaryCapillary
Active phase BP-1DB-5HP-5MSHP-5MSDB-5
Column length (m) 50.30.30.30.30.
Carrier gas HeHeHeHeHe
Substrate
Column diameter (mm) 0.220.250.250.250.22
Phase thickness (μm) 0.250.250.250.250.25
Tstart (C) 60.60.60.60.55.
Tend (C) 220.260.280.280.240.
Heat rate (K/min) 2.5.4.4.3.
Initial hold (min)   5.5.2.
Final hold (min) 20.   15.
I 922.926.929.929.932.
ReferenceLesueur, de Rocca Serra, et al., 2007Sabulal, Dan, et al., 2007Saroglou, Arfan, et al., 2007Saroglou, Marin, et al., 2007Silva, Barbosa, et al., 2007
Comment MSDC-RI MSDC-RI MSDC-RI MSDC-RI MSDC-RI
Column type CapillaryCapillaryCapillaryCapillaryCapillary
Active phase ZB-5HP-5MSCP Sil 5 CBSPB-1DB-5
Column length (m) 30.30.30.30.30.
Carrier gas HeHeN2HeHe
Substrate
Column diameter (mm) 0.250.250.250.250.2
Phase thickness (μm) 0.250.250.250.250.25
Tstart (C) 50.60.50.50.50.
Tend (C) 250.280.200.250.250.
Heat rate (K/min) 3.3.5.5.5.
Initial hold (min)    3.3.
Final hold (min)    15.15.
I 931.930.927.938.928.
ReferenceSimoniatto, Bonani, et al., 2007Vagionas, Ngassapa, et al., 2007Andrianoelisoa H.S., Menut C., et al., 2006Blagojevic, Radulovic, et al., 2006Blagojevic, Radulovic, et al., 2006
Comment MSDC-RI MSDC-RI MSDC-RI MSDC-RI MSDC-RI
Column type CapillaryCapillaryCapillaryCapillaryCapillary
Active phase DB-5DB-5HP-5MSDB-5DB-5
Column length (m) 30.30.30.30.50.
Carrier gas He HeN2N2
Substrate
Column diameter (mm) 0.250.250.250.320.2
Phase thickness (μm) 0.251.0.250.250.32
Tstart (C) 60.50.60.60.60.
Tend (C) 240.290.280.240.220.
Heat rate (K/min) 3.10.3.3.5.
Initial hold (min)  1. 3.3.
Final hold (min)  10. 5.5.
I 933.945.923.924.931.
ReferenceBlock, Flamini, et al., 2006Bylaite and Meyer, 2006Chorianopoulos N., Evergets E., et al., 2006Dob, Dahmane, et al., 2006Esmaeili, Nematollahi, et al., 2006
Comment MSDC-RI MSDC-RI MSDC-RI MSDC-RI MSDC-RI
Column type CapillaryCapillaryCapillaryCapillaryCapillary
Active phase HP-5BP-1DB-1HP-5DB-1
Column length (m) 30.50.30.30.25.
Carrier gas N2HeN2He
Substrate
Column diameter (mm) 0.250.220.250.250.2
Phase thickness (μm) 0.250.250.250.250.33
Tstart (C) 60.60.50.60.50.
Tend (C) 220.220.220.250.300.
Heat rate (K/min) 5.2.4.10.4.
Initial hold (min) 10.  2.
Final hold (min)  20. 10.
I 933.924.928.927.927.
ReferenceFlamini, Tebano, et al., 2006Gonny, Cavaleiro, et al., 2006Kuiate, Bessière, et al., 2006Liu J.M., Nan P., et al., 2006Osorio, Alarcon, et al., 2006
Comment MSDC-RI MSDC-RI MSDC-RI MSDC-RI MSDC-RI
Column type CapillaryCapillaryCapillaryCapillaryCapillary
Active phase HP-5MSDB-5HP-5SPB-1SPB-1
Column length (m) 30.30.60.30.30.
Carrier gas HeHeHeHeHe
Substrate
Column diameter (mm) 0.250.320.250.20.25
Phase thickness (μm) 0.250.250.250.20.25
Tstart (C) 60.60.60.70.50.
Tend (C) 280.280.250.220.250.
Heat rate (K/min) 3.3.3.3.5.
Initial hold (min)     3.
Final hold (min)    15.15.
I 904.925.929.922.931.
ReferencePavlovic, Kovacevic, et al., 2006Pavlovic, Tzakou, et al., 2006Perraudin, Popovici, et al., 2006Pinto, Pina-Vaz, et al., 2006Radulovic, Mananjarasoa, et al., 2006
Comment MSDC-RI MSDC-RI MSDC-RI MSDC-RI MSDC-RI
Column type CapillaryCapillaryCapillaryCapillaryCapillary
Active phase DB-1HP-5SPB-1DB-5DB-5
Column length (m) 30.25.30.30.30.
Carrier gas HeHeHeHeHe
Substrate
Column diameter (mm) 0.250.250.20.250.25
Phase thickness (μm) 0.250.250.20.250.25
Tstart (C) 60.60.70.50.50.
Tend (C) 240.240.220.250.250.
Heat rate (K/min) 4.4.3.5.5.
Initial hold (min)    2.2.
Final hold (min)   15.
I 935.931.923.930.930.
ReferenceRezazadeh, Hamedani, et al., 2006Rezazadeh, Hamedani, et al., 2006Salgueiro L.R., Pinto E., et al., 2006Su, Ho, et al., 2006Su, Ho, et al., 2006, 2
Comment MSDC-RI MSDC-RI MSDC-RI MSDC-RI MSDC-RI
Column type CapillaryCapillaryCapillaryCapillaryCapillary
Active phase HP-5CP Sil 5 CBSPB-1DB-5BP-1
Column length (m) 30.25.30.30.50.
Carrier gas HeHeHeHeHe
Substrate
Column diameter (mm) 0.250.250.250.20.22
Phase thickness (μm) 0.250.40.250.250.25
Tstart (C) 40.80.50.50.60.
Tend (C) 300.270.250.250.220.
Heat rate (K/min) 4.10.5.5.2.
Initial hold (min) 5. 3.3.
Final hold (min)   15.15.20.
I 925.936.938.928.923.
ReferenceVundac, Pfeifhofer, et al., 2006Ziegenbein, Hanssen, et al., 2006Boskovic, Radulovic, et al., 2005Boskovic, Radulovic, et al., 2005Boti J.B., Koukoua G., et al., 2005
Comment MSDC-RI MSDC-RI MSDC-RI MSDC-RI MSDC-RI
Column type CapillaryCapillaryCapillaryCapillaryCapillary
Active phase SE-54HP-5RTX-1MDN-55 % Phenyl methyl siloxane
Column length (m) 50.30.60.30.30.
Carrier gas H2N2 HeHe
Substrate
Column diameter (mm) 0.250.250.220.250.25
Phase thickness (μm) 0.270.250.250.251.
Tstart (C) 50.60.60.50.40.
Tend (C) 300.220.220.250.250.
Heat rate (K/min) 5.5.2.3.7.
Initial hold (min)  10.  10.
Final hold (min)   20. 5.
I 925.933.924.923.946.
ReferenceBrantner, Pfeifhofer, et al., 2005Celik, Gokturk, et al., 2005Cozzani, Muselli, et al., 2005Dugo, Mondello, et al., 2005Estevez, Ventanas, et al., 2005
Comment MSDC-RI MSDC-RI MSDC-RI MSDC-RI MSDC-RI
Column type CapillaryCapillaryCapillaryCapillaryCapillary
Active phase DB-1DB-1HP-5HP-5DB-1
Column length (m) 30.30.30.30.30.
Carrier gas HeHeN2N2He
Substrate
Column diameter (mm) 0.250.250.250.250.25
Phase thickness (μm) 0.250.250.250.250.25
Tstart (C) 40.40.60.60.40.
Tend (C) 250.260.220.220.250.
Heat rate (K/min) 3.2.5.5.3.
Initial hold (min)  5.10.10.
Final hold (min) 20.20.  20.
I 920.905.933.928.921.
ReferenceFanciullino, Gancel, et al., 2005de Feo, Urrunaga Soria, et al., 2005Flamini, Luigi Cioni, et al., 2005Flamini, Luigi Cioni, et al., 2005, 2Gancel, Ollitrault, et al., 2005
Comment MSDC-RI MSDC-RI MSDC-RI MSDC-RI MSDC-RI
Column type CapillaryCapillaryCapillaryCapillaryCapillary
Active phase CP Sil 5 CBDB-1DB-5HP-5HP-5MS
Column length (m) 50.25.25.30.30.
Carrier gas H2 N2HeHe
Substrate
Column diameter (mm) 0.220.250.250.250.25
Phase thickness (μm) 0.130.250.25 0.25
Tstart (C) 40.60.75.60.60.
Tend (C) 300.180.210.260.250.
Heat rate (K/min) 4.3.3.3.4.
Initial hold (min)  10.10. 2.
Final hold (min) 10.10.1. 20.
I 922.931.931.929.931.
ReferenceIdzojtic, Kajba, et al., 2005bin Jantan, Yalvema, et al., 2005bin Jantan, Yalvema, et al., 2005, 2Javidnia, Miri, et al., 2005Pino, Mesa, et al., 2005
Comment MSDC-RI MSDC-RI MSDC-RI MSDC-RI MSDC-RI
Column type CapillaryCapillaryCapillaryCapillaryCapillary
Active phase DB-5SE-54HP-5MSDB-1Mega 5MS
Column length (m) 30.25.60.30.30.
Carrier gas HeH2HeN2He
Substrate
Column diameter (mm) 0.250.250.20.250.25
Phase thickness (μm) 0.250.20.250.250.25
Tstart (C) 40.50.60.50.40.
Tend (C) 260.250.200.200.240.
Heat rate (K/min) 2.4.2.5.3.
Initial hold (min) 5.   2.
Final hold (min) 20. 10.
I 930.931.902.924.920.
ReferenceSenatore, Napolitano, et al., 2005Simionatto, Porto, et al., 2005Smadja, Rondeau, et al., 2005Tchoumbougnang, Zollo, et al., 2005Verzera, Trozzi, et al., 2005
Comment MSDC-RI MSDC-RI MSDC-RI MSDC-RI MSDC-RI
Column type CapillaryCapillaryCapillaryCapillaryCapillary
Active phase HP-5MSSE-54SPB-1SPB-1HP-5
Column length (m) 30.30.30.30.30.
Carrier gas HeHeHeHe
Substrate
Column diameter (mm) 0.250.250.250.20.25
Phase thickness (μm) 0.250.250.250.20.25
Tstart (C) 60.60.70.70.60.
Tend (C) 280.260.220.220.220.
Heat rate (K/min) 3.2.3.3.5.
Initial hold (min)  5.  10.
Final hold (min)   15.15.
I 924.929.923.922.933.
ReferenceAligiannis, Kalpoutzakis, et al., 2004Alma, Nitz, et al., 2004Antunes, Sevinate-Pinto, et al., 2004Cavaleiro, Salgueiro, et al., 2004Ceccarini, Macchia, et al., 2004
Comment MSDC-RI MSDC-RI MSDC-RI MSDC-RI MSDC-RI
Column type CapillaryCapillaryCapillaryCapillaryCapillary
Active phase HP-5MSRTX-5HP-1HP-5DB-5
Column length (m) 30.30.25.30.30.
Carrier gas HeHeHeHeN2
Substrate
Column diameter (mm) 0.250.250.320.250.25
Phase thickness (μm) 0.250.250.170.250.25
Tstart (C) 60.45.50.60.60.
Tend (C) 280.300.200.240.240.
Heat rate (K/min) 3.3.3.3.3.
Initial hold (min)  6.
Final hold (min)  10.
I 923.924.915.933.933.
ReferenceChorianopoulos, Kalpoutzakis, et al., 2004Dugo, Mondello, et al., 2004Fernández-Ocaña, Gómez-Rodríguez, et al., 2004Flamini, Bader, et al., 2004Flamini, Cioni, et al., 2004
Comment MSDC-RI MSDC-RI MSDC-RI MSDC-RI MSDC-RI
Column type CapillaryCapillaryCapillaryCapillaryCapillary
Active phase DB-5BP-1HP-5MSHP-5DB-5
Column length (m) 30.50.30.30.30.
Carrier gas N2 HeHeHe
Substrate
Column diameter (mm) 0.250.220.250.250.25
Phase thickness (μm) 0.250.250.250.250.25
Tstart (C) 60.60.60.60.60.
Tend (C) 240.220.280.260.260.
Heat rate (K/min) 3.2.4.3.3.
Initial hold (min)   5.
Final hold (min)  20.
I 933.923.929.930.930.
ReferenceFlamini, Cioni, et al., 2004Gonny, Bradesi, et al., 2004Grujic-Jovanovic, Skaltsa, et al., 2004Javidnia, Miri, et al., 2004Javidnia, Miri, et al., 2004, 2
Comment MSDC-RI MSDC-RI MSDC-RI MSDC-RI MSDC-RI
Column type CapillaryCapillaryCapillaryCapillaryCapillary
Active phase DB-5MSSPB-1HP-5MSRSL-200Methyl Silicone
Column length (m) 30.30.30.30.50.
Carrier gas HeHeHeH2He
Substrate
Column diameter (mm) 0.250.20.250.320.25
Phase thickness (μm) 0.250.20.250.25
Tstart (C) 40.70.50.40.50.
Tend (C) 280.220.300.280.240.
Heat rate (K/min) 4.3.5.6.3.
Initial hold (min) 2. 5.5.
Final hold (min)  15. 5.
I 924.922.926.930.931.
ReferenceMardarowicz, Wianowska, et al., 2004Moldão-Martins, Beirão-da-Costa, et al., 2004Mumm, Tiemann, et al., 2004Ngassoum, Ousmaila, et al., 2004Özcan and Chalchat, 2004
Comment MSDC-RI MSDC-RI MSDC-RI MSDC-RI MSDC-RI
Column type CapillaryCapillaryCapillaryCapillaryCapillary
Active phase BP-1DB-5HP-5MSHP-5BP-1
Column length (m) 30.30.30.50.50.
Carrier gas N2HeHeHeHe
Substrate
Column diameter (mm) 0.320.250.250.20.22
Phase thickness (μm) 0.250.250.250.20.25
Tstart (C) 60.60.50.40.60.
Tend (C) 220.275.250.250.220.
Heat rate (K/min) 5.4.3.3.2.
Initial hold (min)    15.
Final hold (min) 13.  40.20.
I 930.935.925.930.923.
ReferenceRaina, Kumar, et al., 2004Ramezani, Khaje-Karamoddin, et al., 2004Salido, Valenzuela, et al., 2004Stashenko, Jaramillo, et al., 2004Tam, Thuam, et al., 2004
Comment MSDC-RI MSDC-RI MSDC-RI MSDC-RI MSDC-RI
Column type CapillaryCapillaryCapillaryCapillaryCapillary
Active phase HP-5MSOptima 5DB-5DB-5DB-5
Column length (m) 30.25.30.30.30.
Carrier gas HeHeHeN2He
Substrate
Column diameter (mm) 0.250.250.250.250.25
Phase thickness (μm) 0.250.250.250.250.25
Tstart (C) 60.60.60.60.60.
Tend (C) 280.280.240.220.240.
Heat rate (K/min) 3.3.3.5.3.
Initial hold (min)    10.
Final hold (min)  20.30.
I 906.918.932.933.932.
ReferenceTzakou, Vagias, et al., 2004Vérité, Nacer, et al., 2004Bader, Caponi, et al., 2003Bader, Caponi, et al., 2003, 2Bader, Flamini, et al., 2003
Comment MSDC-RI MSDC-RI MSDC-RI MSDC-RI MSDC-RI
Column type CapillaryCapillaryCapillaryCapillaryCapillary
Active phase OV-1SPB-1RTX-1DB-1DB-1
Column length (m) 25.30.60.30.30.
Carrier gas H2HeHeHeHe
Substrate
Column diameter (mm) 0.250.20.220.250.25
Phase thickness (μm) 0.30.20.250.250.25
Tstart (C) 50.70.60.40.40.
Tend (C) 200.220.230.250.250.
Heat rate (K/min) 3.3.2.2.2.
Initial hold (min) 1.  5.5.
Final hold (min) 20.15.45.20.
I 923.922.924.917.905.
ReferenceBicchi, Rubiolo, et al., 2003Cavaleiro, Salgueiro, et al., 2003Cavalli, Tomi, et al., 2003de Feo, Bruno, et al., 2003de Feo, Urrunaga Soria, et al., 2003
Comment MSDC-RI MSDC-RI MSDC-RI MSDC-RI MSDC-RI
Column type CapillaryCapillaryCapillaryCapillaryCapillary
Active phase HP-5DB-1DB-5DB-5DB-5
Column length (m) 30.30.30.30.25.
Carrier gas N2He N2He
Substrate
Column diameter (mm) 0.250.250.320.250.25
Phase thickness (μm) 0.250.250.50.25
Tstart (C) 60.40.40.75.60.
Tend (C) 220.250.265.230.260.
Heat rate (K/min) 5.3.7.3.4.
Initial hold (min) 10.  10.
Final hold (min)  20.5.
I 932.921.923.927.928.
ReferenceFlamini, Luigi Cioni, et al., 2003Gancel, Ollitrault, et al., 2003Högnadóttir and Rouseff, 2003bin Jantan, Yassin, et al., 2003Javidnia, Miri, et al., 2003
Comment MSDC-RI MSDC-RI MSDC-RI MSDC-RI MSDC-RI
Column type CapillaryCapillaryCapillaryCapillaryCapillary
Active phase HP-5HP-5HP-5MSHP-5HP-5MS
Column length (m) 30.30.30.30.30.
Carrier gas HeHeHeHeHe
Substrate
Column diameter (mm) 0.250.250.250.250.25
Phase thickness (μm) 0.250.250.250.250.25
Tstart (C) 60.60.60.60.50.
Tend (C) 280.240.280.280.250.
Heat rate (K/min) 4.3.3.3.3.
Initial hold (min) 5.
Final hold (min)
I 931.933.927.931.928.
ReferenceKarioti, Skaltsa, et al., 2003Macchioni, Cioni, et al., 2003Mimica-Dukic, Kujundzic, et al., 2003Ngassapa, Runyoro, et al., 2003Salido, Altarejos, et al., 2003
Comment MSDC-RI MSDC-RI MSDC-RI MSDC-RI MSDC-RI
Column type CapillaryCapillaryCapillaryCapillaryCapillary
Active phase RTX-5HP-5HP-5HP-5HP-5
Column length (m) 30.30.30.30.30.
Carrier gas HeHeHeHeHe
Substrate
Column diameter (mm) 0.250.250.250.250.25
Phase thickness (μm) 0.250.250.250.250.25
Tstart (C) 45.60.60.60.60.
Tend (C) 250.280.280.280.280.
Heat rate (K/min) 3.4.3.3.3.
Initial hold (min) 6.5.
Final hold (min)
I 927.929.930.930.929.
ReferenceShellie, Marriott, et al., 2003Skaltsa, Demetzos, et al., 2003Tsiri, Kretsi, et al., 2003Tsiri, Kretsi, et al., 2003Tzakou, Couladis, et al., 2003
Comment MSDC-RI MSDC-RI MSDC-RI MSDC-RI MSDC-RI
Column type CapillaryCapillaryCapillaryCapillaryCapillary
Active phase Mega 5MSDB-5HP-5HP-5RTX-5 MS
Column length (m) 30.30.30.30.30.
Carrier gas He N2 He
Substrate
Column diameter (mm) 0.250.250.250.250.25
Phase thickness (μm) 0.250.250.250.250.25
Tstart (C) 40.50.60.60.45.
Tend (C) 240.280.220.280.180.
Heat rate (K/min) 3.3.5.3.2.5
Initial hold (min) 2.5.10.5.10.
Final hold (min)
I 920.931.933.931.926.
ReferenceVerzera, Trozzi, et al., 2003Economakis, Skaltsa, et al., 2002Flamini, Cioni, et al., 2002Fokialakis, Magiatis, et al., 2002Hudaib, Speroni, et al., 2002
Comment MSDC-RI MSDC-RI MSDC-RI MSDC-RI MSDC-RI
Column type CapillaryCapillaryCapillaryCapillaryCapillary
Active phase SE-30DB-5BP-1DB-5RTX-5
Column length (m) 25.30.50.25.30.
Carrier gas N2HeHeHeHe
Substrate
Column diameter (mm) 0.250.250.220.250.25
Phase thickness (μm) 0.250.250.25 0.25
Tstart (C) 60.60.60.70.45.
Tend (C) 180.260.220.260.300.
Heat rate (K/min) 3.4.2.4.3.
Initial hold (min) 10.   6.
Final hold (min) 10. 20. 10.
I 928.931.922.931.926.
Referencebin Jantan, Ayop, et al., 2002Javidnia, Miri, et al., 2002Lota, de Rocca Serra, et al., 2002Miri, Ramezani, et al., 2002Mondello, Zappia, et al., 2002
Comment MSDC-RI MSDC-RI MSDC-RI MSDC-RI MSDC-RI
Column type CapillaryCapillaryCapillaryCapillaryCapillary
Active phase CP Sil 5 CBCP Sil 5 CBCP Sil 5 CBDB-1RTX-5
Column length (m) 25.30.50.50.30.
Carrier gas N2H2HeHeHe
Substrate
Column diameter (mm) 0.250.250.320.220.25
Phase thickness (μm) 0.250.250.40.250.25
Tstart (C) 60.60.60.60.45.
Tend (C) 280.280.280.220.250.
Heat rate (K/min) 4.2.3.2.3.
Initial hold (min) 6.10.10. 6.
Final hold (min)  40.60.20.
I 914.918.918.923.930.
ReferencePino, Marbot, et al., 2002Pino, Marbot, et al., 2002, 2Pino, Marbot, et al., 2002, 3Pintore, Usai, et al., 2002Shellie, Mondello, et al., 2002
Comment MSDC-RI MSDC-RI MSDC-RI MSDC-RI MSDC-RI
Column type CapillaryCapillaryCapillaryCapillaryCapillary
Active phase RTX-5HP-5HP-5HP-5HP-5MS
Column length (m) 30.30.30.30.30.
Carrier gas HeHeHeHeHe
Substrate
Column diameter (mm) 0.250.250.250.250.25
Phase thickness (μm) 0.250.250.250.250.25
Tstart (C) 45.60.60.60.60.
Tend (C) 250.280.280.380.280.
Heat rate (K/min) 3.3.3.3.3.
Initial hold (min) 6.5.5. 5.
Final hold (min)
I 931.929.929.930.931.
ReferenceShellie, Mondello, et al., 2002Aligiannis, Kalpoutzakis, et al., 2001Aligiannis, Kalpoutzakis, et al., 2001, 2Couladis, Tsortanidou, et al., 2001Giamakis, Kretsi, et al., 2001
Comment MSDC-RI MSDC-RI MSDC-RI MSDC-RI MSDC-RI
Column type CapillaryCapillaryCapillaryCapillaryCapillary
Active phase SE-30BP-1BP-1CP Sil 5 CBHP-5MS
Column length (m) 25.50.50.50.30.
Carrier gas N2HeHeHeHe
Substrate
Column diameter (mm) 0.200.220.220.320.25
Phase thickness (μm)  0.250.250.40.25
Tstart (C) 60.60.60.60.50.
Tend (C) 180.220.220.280.250.
Heat rate (K/min) 3.2.2.3.3.
Initial hold (min) 10.  10.
Final hold (min) 1.  60.
I 927.922.922.918.925.
Referencebin Jantan, Basni, et al., 2001Lota, Serra, et al., 2001Lota, Serra, et al., 2001Pino and Marbot, 2001Salido, Altarejos, et al., 2001
Comment MSDC-RI MSDC-RI MSDC-RI MSDC-RI MSDC-RI
Column type CapillaryCapillaryCapillaryCapillaryCapillary
Active phase HP-5MSBPX-5HP-5CP Sil 8 CBHP-5
Column length (m) 30.50.30. 30.
Carrier gas HeH2He He
Substrate
Column diameter (mm) 0.250.220.20 0.25
Phase thickness (μm) 0.250.250.25 0.25
Tstart (C) 60.60.60.60.40.
Tend (C) 280.180.180.220.200.
Heat rate (K/min) 4.4.4.4.2.
Initial hold (min) 5.5.8.5.5.
Final hold (min)  5.2.30.20.
I 929.929.930.926.922.
ReferenceSkaltsa, Mavrommati, et al., 2001Zabaras and Wyllie, 2001Alonzo, Bosco, et al., 2000Chevance, Farmer, et al., 2000Kim, Thuy, et al., 2000
Comment MSDC-RI MSDC-RI MSDC-RI MSDC-RI MSDC-RI
Column type CapillaryCapillaryCapillaryCapillaryCapillary
Active phase HP-5BP-1BP-1RTX-5SE-30
Column length (m) 30.50.50.10.50.
Carrier gas HeHeHeHe
Substrate
Column diameter (mm) 0.250.220.220.10.2
Phase thickness (μm) 0.250.250.250.1
Tstart (C) 40.60.60.50.50.
Tend (C) 200.230.230.350.250.
Heat rate (K/min) 2.2.2.12.36.
Initial hold (min) 5.
Final hold (min) 20.35.35.
I 913.922.922.928.930.
ReferenceKim, Thuy, et al., 2000Lota, de Rocca Serra, et al., 2000Lota, de Rocca Serra, et al., 2000Mondello, Zappia, et al., 2000Paramonov, Khalilova, et al., 2000
Comment MSDC-RI MSDC-RI MSDC-RI MSDC-RI MSDC-RI
Column type CapillaryCapillaryCapillaryCapillaryCapillary
Active phase Mega 5MSMega 5MSCBP-1CP Sil 8 CBDB-1
Column length (m) 30.30.30.50.60.
Carrier gas HeHeHe
Substrate
Column diameter (mm) 0.250.250.250.320.32
Phase thickness (μm) 0.250.25  1.
Tstart (C) 40.40.60.60.-50.
Tend (C) 240.240.240.220.175.
Heat rate (K/min) 3.3.4.4.6.
Initial hold (min) 2.2. 5.2.
Final hold (min)    30.
I 920.920.930.926.927.3
ReferenceVerzera, la Rosa, et al., 2000Verzera, Trozzi, et al., 2000Zunino, Lopez, et al., 2000Chevance and Farmer, 1999Helmig, Klinger, et al., 1999
Comment MSDC-RI MSDC-RI MSDC-RI MSDC-RI MSDC-RI
Column type CapillaryCapillaryCapillaryCapillaryCapillary
Active phase BP-1BP-1BP-1BP-1OV-101
Column length (m) 50.50.50.50.25.
Carrier gas HeHeHeHeN2
Substrate
Column diameter (mm) 0.220.220.220.220.25
Phase thickness (μm) 0.250.250.250.25
Tstart (C) 60.60.60.60.50.
Tend (C) 230.230.230.220.200.
Heat rate (K/min) 2.2.2.2.5.
Initial hold (min)
Final hold (min) 35.35.35.20.
I 922.922.922.922.928.
ReferenceLota, Serra, et al., 1999Lota, Serra, et al., 1999Lota, Serra, et al., 1999Mazzoni, Tomi, et al., 1999Menut, Bessiere, et al., 1999
Comment MSDC-RI MSDC-RI MSDC-RI MSDC-RI MSDC-RI
Column type CapillaryCapillaryCapillaryCapillaryCapillary
Active phase DB-1HP-1Methyl SiliconeCP Sil 5 CBOV-1
Column length (m) 30.60.50.25.25.
Carrier gas  HeN2He
Substrate
Column diameter (mm) 0.250.250.250.250.25
Phase thickness (μm) 0.250.250.17 0.3
Tstart (C) 50.50.80.60.50.
Tend (C) 220.250.200.260.200.
Heat rate (K/min) 3.2.52.5.3.
Initial hold (min) 3.5.  1.
Final hold (min)     20.
I 917.927.938.927.924.
ReferenceMuselli, Hoi, et al., 1999Stashenko, Cervantes, et al., 1999Sumathykutty, Rao, et al., 1999Weyerstahl, Marschall, et al., 1999Bicchi, Rubiolo, et al., 1998
Comment MSDC-RI MSDC-RI MSDC-RI MSDC-RI MSDC-RI
Column type CapillaryCapillaryCapillaryCapillaryCapillary
Active phase BP-1DB-5DB-1Methyl SiliconeDB-1
Column length (m) 50.30.60.25.60.
Carrier gas HeHeHeHe
Substrate
Column diameter (mm) 0.220.260.250.20.32
Phase thickness (μm) 0.250.250.250.30.5
Tstart (C) 60.50.50.40.40.
Tend (C) 230.225.250.200.290.
Heat rate (K/min) 2.2.3.52.4.
Initial hold (min)   5. 2.
Final hold (min) 35.20.  5.
I 924.930.941.934.925.
ReferenceMariotti, Costa, et al., 1997Sagrero-Nieves, Bartley, et al., 1997Stashenko, Prada, et al., 1996Píry, Príbela, et al., 1995Bartley and Foley, 1994
Comment MSDC-RI MSDC-RI MSDC-RI MSDC-RI MSDC-RI
Column type CapillaryCapillaryCapillaryCapillaryCapillary
Active phase DB-1HP-101OV-101OV-101DB-5
Column length (m) 60.50.50.50.60.
Carrier gas HeN2N2N2He
Substrate
Column diameter (mm) 0.250.250.250.250.32
Phase thickness (μm) 0.25   1.
Tstart (C) 70.70.80.80.40.
Tend (C) 250.200.200.200.220.
Heat rate (K/min) 2.53.2.2.3.
Initial hold (min) 5.
Final hold (min) 15.
I 924.930.929.930.923.
ReferenceCombariza, Tirado, et al., 1994Chung, Eiserich, et al., 1993Yang, Sugisawa, et al., 1992Yang, Sugisawa, et al., 1992Le Quere and Latrasse, 1990
Comment MSDC-RI MSDC-RI MSDC-RI MSDC-RI MSDC-RI
Column type Capillary
Active phase CP Sil 5 CB
Column length (m) 25.
Carrier gas N2
Substrate
Column diameter (mm) 0.22
Phase thickness (μm)
Tstart (C) 70.
Tend (C) 295.
Heat rate (K/min) 4.
Initial hold (min)
Final hold (min)
I 930.
ReferenceMontanarella, Bos, et al., 1986
Comment MSDC-RI

Van Den Dool and Kratz RI, non-polar column, custom temperature program

Data compiled by: NIST Mass Spectrometry Data Center, William E. Wallace, director

Column type CapillaryCapillaryCapillaryCapillaryCapillary
Active phase BPX-5BPX-5SE-52DB-5SE-52
Column length (m) 30.30.30. 30.
Carrier gas He He He
Substrate
Column diameter (mm) 0.250.250.32 0.32
Phase thickness (μm) 0.250.250.15 0.15
Program 35C => 4C/min => 200C => 30C/min => 300C (3min)35C(5min) => 3C/min => 210C => 40C/min => 240C (4min)45C => 1C/min => 100C => 5C/min => 250C (10min)not specified45C => 1C/min => 100C => 5C/min => 250C(10min)
I 926.930.931.938.930.
ReferenceDharmawan, Kasapis, et al., 2007Cardeal, da Silva, et al., 2006Guerrini, Sacchetti, et al., 2006Özel, Gögüs, et al., 2006Sacchetti, Guerrini, et al., 2006
Comment MSDC-RI MSDC-RI MSDC-RI MSDC-RI MSDC-RI
Column type CapillaryCapillaryCapillaryCapillaryCapillary
Active phase HP-5MSSE-52SE-525 % Phenyl methyl siloxaneDB-5MS
Column length (m) 30.30.25.30.30.
Carrier gas HeHeH2HeHe
Substrate
Column diameter (mm) 0.250.320.320.320.25
Phase thickness (μm) 0.250.150.430.150.25
Program 50C (3min) => 3C/min => 200C => 6C/min => 240C45C => 1C/min => 100C => 5C/min => 250C(10min)60C(8min) => 3C/min => 180C => 20C/min => 250C(10min)45C => 1C/min => 100C => 5C/min => 250C (10min)40 (5min) => 4C/min => 140C => 4C/min => 200C (20min)
I 930.930.919.930.925.
ReferenceAkpulat, Tepe, et al., 2005Bruni, Pellati, et al., 2005Lorenzo, Paz, et al., 2005Sacchetti, Maietti, et al., 2005Zheng, Kim, et al., 2005
Comment MSDC-RI MSDC-RI MSDC-RI MSDC-RI MSDC-RI
Column type CapillaryCapillaryCapillaryCapillaryCapillary
Active phase SE-52DB-5MSBP-1SE-52SE-52
Column length (m) 25.30.50.25.30.
Carrier gas H2He H2H2
Substrate
Column diameter (mm) 0.320.250.220.320.32
Phase thickness (μm) 0.430.250.250.400.40
Program 60C(8min) => 3C/min => 180C => 20C/min => 250C(10min)40C(5min) => 4C/min => 160C => 8C/min => 240C (15min)not specified60 0C (8 min) 3 K/min -> 180 0C 20 K/min -> 250 0C (10 min)60 0C (8 min) 3 K/min -> 180 0C 20 K/min -> 250 0C (10 min)
I 921.923.924.923.910.
ReferenceFrizzo, Lorenzo, et al., 2004Kim, Lee, et al., 2003Cavalli, Ranarivelo, et al., 2001Lorenzo, Dellacassa, et al., 2001Lorenzo, Paz, et al., 2001
Comment MSDC-RI MSDC-RI MSDC-RI MSDC-RI MSDC-RI
Column type CapillaryCapillaryCapillaryCapillaryCapillary
Active phase DB-1SE-52SE-54SE-54SE-52
Column length (m) 60.25.30.30.60.
Carrier gas HeHeHeHeHe
Substrate
Column diameter (mm) 0.250.250.320.320.32
Phase thickness (μm) 0.250.250.250.250.40
Program -20C (5min) => 10C/min => 100C => 4C/min => 200C => 10C/min => 280C60 0C (8 min) 3 K/min -> 180 0C 20 K/min -> 230 0C35C (2min) => 40C/min => 60C (2min) => 6C/min => 180C => 10C/min => 230C (5min)35 0C 40 0C/min -> 60 0C (2 min) 6 0C/min -> 180 0C 10 0C/min -> 230 0C45 C (6 min) 3 C/min -> 111 0C 2 C/min -> 160 C 3 C/min -> 300 C (15 min)
I 920.919.919.919.925.
ReferenceEri, Khoo, et al., 2000Loayza, de Groot, et al., 1999Tairu, Hofmann, et al., 1999Tairu, Hofmann, et al., 1999, 2Mondello, Dugo, et al., 1995
Comment MSDC-RI MSDC-RI MSDC-RI MSDC-RI MSDC-RI

Normal alkane RI, non-polar column, isothermal

Data compiled by: NIST Mass Spectrometry Data Center, William E. Wallace, director

Column type Capillary
Active phase DB-5
Column length (m)
Carrier gas
Substrate
Column diameter (mm)
Phase thickness (μm)
Temperature (C) 25.
I 931.
ReferenceHemmateenejad, Jawadnia, et al., 2007
Comment MSDC-RI

Phase change data

Data compiled by: William E. Acree, Jr., James S. Chickos

Quantity Value Units Method Reference Comment
Δvap10.7kcal/molGCHoskovec, Grygarová, et al., 2005Based on data from 313. - 413. K.

References

Bendiabdellah, El Amine Dib, et al., 2012
Bendiabdellah, A.; El Amine Dib, M.; Djabou, N.; Allali, H.; Tabti, B.; Costa, J.; Myseli, A., Biological activities and volatile cinstituents of Daucus muricatus L. from Algeria, Chem. Centr. J., 2012, 6, 48, 1-22. [all data]

Menichini, Tundis, et al., 2011
Menichini, F.; Tundis, R.; Bonesi, M.; de Cindio, B.; Loizzo, M.R.; Conforti, F.; Statti, G.A.; Menabeni, R.; Bettini, R.; Menichini, F., Chemical composition and bioactivity of Citrus medica L. cv. Diamante essential oil obtained by hydrodistillation, cold-pressing and supercritical carbon dioxide extraction, Nat. Prod. Res., 2011, 25, 8, 789-799, https://doi.org/10.1080/14786410902900085 . [all data]

Zeng, Xie, et al., 2011
Zeng, Z.; Xie, R.; Zhang, T.; Zhang, H.; Chen, J.Y., Analysis of volatile compositions of Magnolia biondii Pamp by steam distillation and Headspace solid phase micro-extraction, J. Oleo Sci., 2011, 60, 12, 591-596, https://doi.org/10.5650/jos.60.591 . [all data]

Neves, Rosa, et al., 2010
Neves, A.; Rosa, S.; Goncalves, J.; Rufino, A.; Judas, F.; Salgueiro, L.; Lopes, M.C.; Cavaleiro, C.; Mendes, A.F., Screening of five essential oils for identification of potential inhibitors of IL-1-unduced Nf-kB activation and NO production in human clondrocytes: characterization of the inhibitory activity of alpha-pinene, Plante Med., 2010, 76, 03, 303-308, https://doi.org/10.1055/s-0029-1186085 . [all data]

Vahirua-Lechat, Mitermite, et al., 2010
Vahirua-Lechat, I.; Mitermite, Y.; Menut, C., Aromatic plants of French Polynesia. IV. Composition and chemical variations of the essential oils of leaves of Etlingera cevuga (seeman) R.E. Smith, J. Essen. Oil Res., 2010, 22, 5, 407-409, https://doi.org/10.1080/10412905.2010.9700357 . [all data]

Museli, Pau, et al., 2009
Museli, A.; Pau, M.; Desjobert, J.-M.; Foddai, M.; Usai, M.; Costa, J., Volatile constituents of Achllea ligustica All. by HS-SPME/GC/GC-MS. Comparison with essential oils obtained by hydrodistillation from Corsica and Sardinia, Chromatographia, 2009, 69, 5/6, 575-585, https://doi.org/10.1365/s10337-008-0939-1 . [all data]

Wannes, Mhamdi, et al., 2009
Wannes, W.A.; Mhamdi, B.; Marzouk, B., GC comparative analysis of least essential oils from two Myrtle varieties at different phenological stages, Chromatographia, 2009, 69, 1/2, 145-150, https://doi.org/10.1365/s10337-008-0818-9 . [all data]

Cheraif, Ben Jannet, et al., 2007
Cheraif, I.; Ben Jannet, H.; Hammami, M.; Khouja, M.L.; Mighri, Z., Chemical composition and antimicrobial activity of essential oils of Cupressus arizonica Greene, Biochem. Syst. Ecol., 2007, 35, 12, 813-820, https://doi.org/10.1016/j.bse.2007.05.009 . [all data]

Chyau, Tsai, et al., 2007
Chyau, C.-C.; Tsai, S.-Y.; Yang, J.-H.; Weng, C.-C.; Han, C.-M.; Shih, C.-C.; Mau, J.-L., The essential oil of Glossogyne tenuifolia, Food Chem., 2007, 100, 2, 808-812, https://doi.org/10.1016/j.foodchem.2005.10.044 . [all data]

Ferhat, Meklati, et al., 2007
Ferhat, M.A.; Meklati, B.Y.; Chemat, F., Comparison of different isolation methods of essential oil from Citrus fruits: cold pressing, hydrodistillation and microwave dry distillation, Flavour Fragr. J., 2007, 22, 6, 494-504, https://doi.org/10.1002/ffj.1829 . [all data]

Hymete, Rohloff, et al., 2007
Hymete, A.; Rohloff, J.; Iversen, T.-H.; Kjosen, H., Volatile constituents of the roots of Echinops kebericho Mesfin, Flavour Fragr. J., 2007, 22, 1, 35-38, https://doi.org/10.1002/ffj.1746 . [all data]

Pinto, Salgueiro, et al., 2007
Pinto, E.; Salgueiro, L.R.; Cavaleiro, C.; Palmeira, A.; Goncalves, M.J., In vitro susceptibility of some species of yeasts and filamentous fungi to essential oils of Salvia of?cinalis, Ind. Crops Prod., 2007, 26, 2, 135-141, https://doi.org/10.1016/j.indcrop.2007.02.004 . [all data]

Povolo, Contarini, et al., 2007
Povolo, M.; Contarini, G.; Mele, M.; Secchiari, P., Study on the influence of pasture on volatile fraction of Ewes' dairy products by solid-phase microextraction and gas chromatography-mass spectrometry, J. Dairy Sci., 2007, 90, 2, 556-569, https://doi.org/10.3168/jds.S0022-0302(07)71539-4 . [all data]

Raal, Orav, et al., 2007
Raal, A.; Orav, A.; Arak, E.; Kailas, T.; Müürisepp, M., Variation in the composition of the essential oil of Valeriana officinalis L. roots from Estonia, Proc. Est. Acad. Sci. Chem., 2007, 56, 2, 67-74. [all data]

Singh, Kumar, et al., 2007
Singh, B.; Kumar, R.; Bhandari, S.; Pathania, S.; Lal, B., Volatile constituents of natural Boswellia serrata oleo-gum-resin and commercial samples, Flavour Fragr. J., 2007, 22, 2, 145-147, https://doi.org/10.1002/ffj.1772 . [all data]

Sylvestre, Pichette, et al., 2007
Sylvestre, M.; Pichette, A.; Longtin, A.; Martin, M.-A.C.; Bercion, S.R.; Legault, J., Chemical composition of leaf essential oil of Hedyosmum arborescens and evaluation of its anticancer activity, Natural Product Communications, 2007, 2, 12, 1269-1272. [all data]

Vichi, Riu-Aumatell, et al., 2007
Vichi, S.; Riu-Aumatell, M.; Mora-Pons, M.; Guadayol, J.M.; Buxaderas, S.; López-Tamames, E., Analytical, Nutritional and Clinical Methods. HS-SPME coupled to GC/MS for quality control of Juniperus communis L. berries used for gin aromatization, Food Chem., 2007, 105, 4, 1748-1754, https://doi.org/10.1016/j.foodchem.2007.03.026 . [all data]

Abdelwahed, Hayder, et al., 2006
Abdelwahed, A.; Hayder, N.; Kilani, S.; Mahmoud, A.; Chibani, J.; Hammami, M.; Chekir-Ghedira, L.; Ghedira, K., Chemical composition and antimicrobial activity of essential oils from Tunisian Pituranthos tortuosus (Coss.) Maire, Flavour Fragr. J., 2006, 21, 1, 129-133, https://doi.org/10.1002/ffj.1542 . [all data]

Borges, Rojas, et al., 2006
Borges, R.; Rojas, L.B.; Cegarra, J.A.; Usubillaga, A., Study of the essential oils from the leaves and flowers of Lepechinia conferta (Benth) Epl., Flavour Fragr. J., 2006, 21, 1, 155-157, https://doi.org/10.1002/ffj.1550 . [all data]

Boti, Yao, et al., 2006
Boti, J.B.; Yao, P.A.; Koukoua, G.; N'Guessan, T.Y.; Casanova, J., Components and chemical variability of Isolona campanulata Engler Diels leaf oil, Flavour Fragr. J., 2006, 21, 1, 166-170, https://doi.org/10.1002/ffj.1555 . [all data]

Cavaleiro, Pinto, et al., 2006
Cavaleiro, C.; Pinto, E.; Gonsales, M.J.; Salguero, L., Antifungal activity of Juniperus essential oils agains dermatophyte, Asrgillus and Candida strains, J. Appl. Microbiol., 2006, 100, 6, 1333-1338, https://doi.org/10.1111/j.1365-2672.2006.02862.x . [all data]

Fanciullino, Tomi, et al., 2006
Fanciullino, A.-L.; Tomi, F.; Luro, F.; Desjobert, J.M.; Casanova, J., Chemical variability of peel and leaf oils of mandarins, Flavour Fragr. J., 2006, 21, 2, 359-367, https://doi.org/10.1002/ffj.1658 . [all data]

Hymete, Rohloff, et al., 2006
Hymete, A.; Rohloff, J.; Iversen, T.-H., Essential oil from seeds and husks of Aframomum corrorima from Ethiopia, Flavour Fragr. J., 2006, 21, 4, 642-644, https://doi.org/10.1002/ffj.1634 . [all data]

Kitchlu, Bakshi, et al., 2006
Kitchlu, S.; Bakshi, S.K.; Kaul, M.K.; Bhan, M.K.; Thapa, R.K.; Agarwal, S.G., Tanacetum gracile Hook. f T. A new source of lavandulol from Ladakh Himalaya (India), Flavour Fragr. J., 2006, 21, 4, 690-692, https://doi.org/10.1002/ffj.1674 . [all data]

Martin, Joseph, et al., 2006
Martin, M.A.C.K.; Joseph, H.; Bercion, S.; Menut, C., Chemical composition of essential oils from aerial parts of Aframomum exscapum (Sims) Hepper collected in Guadeloupe, French West Indies, Flavour Fragr. J., 2006, 21, 6, 902-905, https://doi.org/10.1002/ffj.1741 . [all data]

Orav, Raal, et al., 2006
Orav, A.; Raal, A.; Arak, E.; Müürisepp, M.; Kailas, T., Composition of the essential oil of Artemisia absinthium L. of different geographical origin, Proc. Est. Acad. Sci. Chem., 2006, 55, 3, 155-165. [all data]

Wong, Lim, et al., 2006
Wong, K.C.; Lim, T.B.; Ali, D.M.H., Essential oil of Homalomena sagittifolia Jungh., Flavour Fragr. J., 2006, 21, 5, 786-788, https://doi.org/10.1002/ffj.1714 . [all data]

Wong, Sivasothy, et al., 2006
Wong, K.C.; Sivasothy, Y.; Boey, P.L., Essential oil of Elettariopsis elan C.K. Lim, Flavour Fragr. J., 2006, 21, 3, 562-564, https://doi.org/10.1002/ffj.1654 . [all data]

Bendimerad and Bendiab, 2005
Bendimerad, N.; Bendiab, S.A.T., Composition and antibacterial activity of Pseudocytisus integrifolius (Salisb.) essential oil from Algeria, J. Agric. Food Chem., 2005, 53, 8, 2947-2952, https://doi.org/10.1021/jf047937u . [all data]

Bezic, Skocibusic, et al., 2005
Bezic, N.; Skocibusic, M.; Dunkic, V., Phytochemical Composition and Antimicrobial Activityof Satureja montana L. and Satureja cunefolia Ten. Essential Oils, Acta Bot. Croat., 2005, 64, 2, 313-322. [all data]

Fernandez, Lizzani-Cuvelier, et al., 2005
Fernandez, X.; Lizzani-Cuvelier, L.; Loiseau, A.-M.; Perichet, C.; Delbecque, C.; Arnaudo, J.-F., Chemical composition of the essential oils from Turkish and Honduras Styrax, Flavour Fragr. J., 2005, 20, 1, 70-73, https://doi.org/10.1002/ffj.1370 . [all data]

Jirovetz, Buchbauer, et al., 2005
Jirovetz, L.; Buchbauer, G.; Ngassoum, M.B.; Parmentier, M., Chemical composition and olfactory characterization of essential oils of fruits and seeds of African pear (Dacryodes edulis (G. Don) H. J. Lam) from Cameroon, Flavour Fragr. J., 2005, 20, 2, 215-218, https://doi.org/10.1002/ffj.1324 . [all data]

Kulisic, Radonic, et al., 2005
Kulisic, T.; Radonic, A.; Milos, M., Inhibition of Lard Oxidation by Fractions of Different Essential Oil, Grasas y Aceites, 2005, 56, 4, 284-291, https://doi.org/10.3989/gya.2005.v56.i4.94 . [all data]

Njoroge, Koaze, et al., 2005
Njoroge, S.M.; Koaze, H.; Mwaniki, M.; Minh Tu, N.T.; Sawamura, M., Essential oils of Kenyan Citrus fruits: volatile components of two varieties of mandarins (Citrus reticulata) and a tangelo (C. paradisi × C. tangerina), Flavour Fragr. J., 2005, 20, 1, 74-79, https://doi.org/10.1002/ffj.1376 . [all data]

Rohloff and Bones, 2005
Rohloff, J.; Bones, A.M., Volatile profiling of Arabidopsis thaliana - Putative olfactory compounds in plant communication, Phytochemistry, 2005, 66, 16, 1941-1955, https://doi.org/10.1016/j.phytochem.2005.06.021 . [all data]

Salehi, Sonboli, et al., 2005
Salehi, P.; Sonboli, A.; Eftekhar, F.; Nejad-Ebrahimi, S.; Yousefzadi, M., Essential Oil Composition, Antibacterial and Antioxidant Activity of the Oil and Various Extracts of Ziziphora clinopodioides subsp. rigida (BOISS.) RECH. f. from Iran, Biol. Pharm. Bull., 2005, 28, 10, 1892-1896, https://doi.org/10.1248/bpb.28.1892 . [all data]

Stevanovic, Garneau, et al., 2005
Stevanovic, T.; Garneau, F.-X.; Jean, F.-I.; Gagnon, H.; Vilotic, D.; Petrovic, S.; Ruzic, N.; Pichette, A., The essential oil composition of Pinus mugo Turra from Serbia, Flavour Fragr. J., 2005, 20, 1, 96-97, https://doi.org/10.1002/ffj.1390 . [all data]

Vichi, Riu-Aumatell, et al., 2005
Vichi, S.; Riu-Aumatell, M.; Mora-Pons, M.; Buxaderas, S.; Lopez-Tamames, E., Characterization of Volatiles in Different Dry Gins, J. Agric. Food Chem., 2005, 53, 26, 10154-10160, https://doi.org/10.1021/jf058121b . [all data]

Agnihotri, Thappa, et al., 2004
Agnihotri, V.K.; Thappa, R.K.; Meena, B.; Kapahi, B.K.; Saxena, R.K.; Qazi, G.N.; Agarwal, S.G., Essential oil composition of aerial parts of Angelica glauca growing wild in North-West Himalaya (India), Phytochemistry, 2004, 65, 16, 2411-2413, https://doi.org/10.1016/j.phytochem.2004.07.004 . [all data]

Lopez Arze, Collin, et al., 2004
Lopez Arze, J.B.; Collin, G.; Garneau, F.-X.; Jean, F.-I.; Gagnon, H., Essential oils from Bolivia. II. Asteraceae: Ophryosporus heptanthus (Wedd.) H. Rob. et King, J. Essent. Oil Res., 2004, 16, 4, 374-376, https://doi.org/10.1080/10412905.2004.9698747 . [all data]

Orav, Stulova, et al., 2004
Orav, A.; Stulova, I.; Kailas, T.; Müürisepp, M., Effect of storage on the essential oil composition of piper nigrum L. fruits of different ripening states, J. Agric. Food Chem., 2004, 52, 9, 2582-2586, https://doi.org/10.1021/jf030635s . [all data]

Raal, Arak, et al., 2004
Raal, A.; Arak, E.; Orav, A., Chemical composition of coriander seed essential oil and their conformity with EP standards, Agraarteadus, 2004, 15, 4, 234-239. [all data]

Bertoli, Menichini, et al., 2003
Bertoli, A.; Menichini, F.; Mazzetti, M.; Spinelli, G.; Morelli, I., Volatile constituents of the leaves and flowers of Hypericum triquetrifolium Turra, Flavour Fragr. J., 2003, 18, 2, 91-94, https://doi.org/10.1002/ffj.1161 . [all data]

Juteau, Jerkovic, et al., 2003
Juteau, F.; Jerkovic, I.; Masotti, V.; Milos, M.; Mastelic, J.; Bessière, J.-M.; Viano, J., Composition and antimicrobial activity of the essential oil of Artemisia absinthium from Croatia and France, Planta Medica, 2003, 69, 2, 158-161, https://doi.org/10.1055/s-2003-37714 . [all data]

Orav, Kailas, et al., 2003
Orav, A.; Kailas, T.; Jegorova, A., Composition of the essential oil of dill, celery, and parsley from Estonia, Proc. Est. Acad. Sci. Chem., 2003, 52, 4, 147-154. [all data]

Stashenko, Jaramillo, et al., 2003
Stashenko, E.E.; Jaramillo, B.E.; Martínez, J.R., Comparación de la composición química y de la actividad antioxidante in vitro de los metabolitos secundarios volátiles de plantas de la familia verbenaceae, Rev. Acad. Colomb. Cienc. Exactas Fis. Nat., 2003, 27, 105, 579-597. [all data]

Suleimenov, Atazharova, et al., 2003
Suleimenov, E.M.; Atazharova, G.A.; Demirchi, B.; Baser, K.H.C.; Adekenov, S.M., Essential oil composition of Artemisia Lercheana and A. Sieversiana of Kazakhstan flora in Recent problems of development of new medicines of natural origin, Proceedings of symposium, St.Petersburg - Pushkin, 2003, 382-385. [all data]

Velasco-Negueruela, Pérez-Alonso, et al., 2003
Velasco-Negueruela, A.; Pérez-Alonso, M.J.; Pérez de Paz, P.L.; Palá-Paúl, J.; Sanz, J., Analysis by gas chromatography-mass spectrometry of the essential oils from the aerial parts of Rutheopsis herbanica (Bolle) Hans. Kunk., gathered in Fuerteventura (Canary Islands), J. Chromatogr. A, 2003, 984, 1, 159-162, https://doi.org/10.1016/S0021-9673(02)01742-9 . [all data]

Zrira, Elamrani, et al., 2003
Zrira, S.; Elamrani, A.; Benjilali, B., Chemical composition of the essential oil of Pistacia lentiscus L. from Morocco - a seasonal variation, Flavour Fragr. J., 2003, 18, 6, 475-480, https://doi.org/10.1002/ffj.1221 . [all data]

Gancel, Ollé, et al., 2002
Gancel, A.-L.; Ollé, D.; Ollitrault, P.; Luro, F.; Brillouet, J.-M., Leaf and peel volatile compounds of an interspecific citrus somatic hybrid [Citrus aurantifolia (Christm.) Swing. + Citrus paradisi Macfayden], Flavour Fragr. J., 2002, 17, 6, 416-424, https://doi.org/10.1002/ffj.1119 . [all data]

Orav, Kailas, et al., 2002
Orav, A.; Kailas, T.; Müürisepp, M., Composition of blackcurrant aroma isolated from leaves, buds, and berries of Ribes nigrum L., Proc. Est. Acad. Sci. Chem., 2002, 51, 4, 225-234. [all data]

Bendall, 2001
Bendall, J.G., Aroma compounds of fresh milk from New Zealand cows fed different diets, J. Agric. Food Chem., 2001, 49, 10, 4825-4832, https://doi.org/10.1021/jf010334n . [all data]

Christoph, 2001
Christoph, F., Chemische Zuzammensetzung und antimikrobielle Eigenschaften der ätherischen Öle von Leptospermum scoparium J. R. et G. Forst. und anderer Teebaumöle der Gattungen Kunzea, Leptospermum und Melaleuca unter besonderer Berücksichtigung von Handelsölen, Dissertation, University of Hamburg, Germany, 2001, 196. [all data]

Lota, de Rocca Serra, et al., 2001
Lota, M.-L.; de Rocca Serra, D.; Tomi, F.; Casanova, J., Chemical variability of peel and leaf essential oils of 15 species of mandarins, Biochem. Syst. Ecol., 2001, 29, 1, 77-104, https://doi.org/10.1016/S0305-1978(00)00029-6 . [all data]

Orav and Kann, 2001
Orav, A.; Kann, J., Determination of peppermint and orange aroma compounds in food and beverages, Proc. Est. Acad. Sci. Chem., 2001, 50, 4, 217-225. [all data]

Buttery, Light, et al., 2000
Buttery, R.G.; Light, D.M.; Nam, Y.; Merrill, G.B.; Roitman, J.N., Volatile components of green walnut husks, J. Agric. Food Chem., 2000, 48, 7, 2858-2861, https://doi.org/10.1021/jf000288b . [all data]

Mallavarapu, Rao, et al., 2000
Mallavarapu, G.R.; Rao, L.; Ramesh, S., Volatile constituents of the leaf and fruit oils of Murraya koenigii Spreng., L. Ess. Oil Res., 2000, 12, 6, 766-768, https://doi.org/10.1080/10412905.2000.9712211 . [all data]

Mastelic, Milos, et al., 2000
Mastelic, J.; Milos, M.; Jerkovic, I., Essential oil and glycosidically bound volatiles of Origanum vulgare L. ssp. hirtum (Link) letswaart, Flavour Fragr. J., 2000, 15, 3, 190-194, https://doi.org/10.1002/1099-1026(200005/06)15:3<190::AID-FFJ890>3.0.CO;2-O . [all data]

Umano, Hagi, et al., 2000
Umano, K.; Hagi, Y.; Nakahara, K.; Shoji, A.; Shibamoto, T., Volatile chemicals identified in extracts from leaves of Japanese mugwort (Artemisia princeps Pamp.), J. Agric. Food Chem., 2000, 48, 8, 3463-3469, https://doi.org/10.1021/jf0001738 . [all data]

Kaya, Baser, et al., 1999
Kaya, A.; Baser, K.H.C.; Demirci, B.; Koca, F., The essential oil of Acinos alpinus (L.) Moench growing in Turkey, Flavour Fragr. J., 1999, 14, 1, 55-59, https://doi.org/10.1002/(SICI)1099-1026(199901/02)14:1<55::AID-FFJ784>3.0.CO;2-Q . [all data]

Onocha, Ekundayo, et al., 1999
Onocha, P.A.; Ekundayo, O.; Oyelola, O.; Laakso, I., Essential oils of Dacryodes edulis (G. Don) H. J. Lam (African pear), Flavour Fragr. J., 1999, 14, 2, 135-139, https://doi.org/10.1002/(SICI)1099-1026(199903/04)14:2<135::AID-FFJ788>3.0.CO;2-L . [all data]

Rao, Bhattacharya, et al., 1999
Rao, B.R.R.; Bhattacharya, A.K.; Mallavarapu, G.R.; Ramesh, S., Volatile constituents of different parts of cornmint (Mentha arvensis L.), Flavour Fragr. J., 1999, 14, 5, 262-264, https://doi.org/10.1002/(SICI)1099-1026(199909/10)14:5<262::AID-FFJ766>3.0.CO;2-6 . [all data]

Weyerstahl, Marschall, et al., 1999
Weyerstahl, P.; Marschall, H.; Thefeld, K.; Rustaiyan, A., Constituents of the essential oil of Tanacetum (syn. Chrysanthemum) fruticulosum Ledeb. from Iran, Flavour Fragr. J., 1999, 14, 2, 112-120, https://doi.org/10.1002/(SICI)1099-1026(199903/04)14:2<112::AID-FFJ786>3.0.CO;2-1 . [all data]

Mölleken, Sinnwell, et al., 1998
Mölleken, U.; Sinnwell, V.; Kubeczka, K.-H., Essential oil composition of Smyrnium olusatrum, Phytochemistry, 1998, 49, 6, 1709-1714, https://doi.org/10.1016/S0031-9422(98)00195-2 . [all data]

Stashenko, Cervantes, et al., 1998
Stashenko, E.E.; Cervantes, M.; Combariza, Y.; Martínez, J.R., HRGC-FID-MSD Analysis of the Secondary Metabolites Obtained by Different Extraction Methods from Lepechinia schiedeana, and Evaluation of its Antioxidant Activity in vitro in 20th International Symposium on Capillary Chromatography, 1998, 1-11. [all data]

Zunino, Novillo-Newton, et al., 1997
Zunino, M.P.; Novillo-Newton, M.; Maestri, D.M.; Zygadlo, J.A., Composition of the essential oil of Baccharis crispa Spreng. and Baccharis salicifolia Pers. grown in Cordoba (Argentina), Flavour Fragr. J., 1997, 12, 6, 405-407, https://doi.org/10.1002/(SICI)1099-1026(199711/12)12:6<405::AID-FFJ667>3.0.CO;2-R . [all data]

Brophy, Goldsack, et al., 1996
Brophy, J.J.; Goldsack, R.J.; Bean, A.R.; Forster, P.I.; Fookes, C.J.R., The leaf essential oils of the genus Syncarpia ten. (Myrtaceae), Flavour Fragr. J., 1996, 11, 6, 361-366, https://doi.org/10.1002/(SICI)1099-1026(199611)11:6<361::AID-FFJ591>3.0.CO;2-T . [all data]

Stashenko, Puertas, et al., 1996
Stashenko, E.E.; Puertas, M.A.; Combariza, M.Y., Volatile secondary metabolites from Spilanthes americana obtained by simultaneous steam distillation--solvent extraction and supercritical fluid extraction, J. Chromatogr. A, 1996, 752, 1-2, 223-232, https://doi.org/10.1016/S0021-9673(96)00480-3 . [all data]

Wong and Lai, 1996
Wong, K.C.; Lai, F.Y., Volatile constituents from the fruits of four Syzygium species grown in Malaysia, Flavour Fragr. J., 1996, 11, 1, 61-66, https://doi.org/10.1002/(SICI)1099-1026(199601)11:1<61::AID-FFJ539>3.0.CO;2-1 . [all data]

Tirado, Stashenko, et al., 1995
Tirado, C.B.; Stashenko, E.E.; Combariza, M.Y.; Martinez, J.R., Comparative study of Colombian citrus oils by high-resolution gas chromatography and gas chromatography-mass spectrometry, J. Chromatogr. A, 1995, 697, 1-2, 501-513, https://doi.org/10.1016/0021-9673(94)00955-9 . [all data]

Kollmannsberger, Nitz, et al., 1992
Kollmannsberger, H.; Nitz, S.; Drawert, F., UBer die Aromastoffzusammensetzung von Hochdruckextrakten. I. Pfeffer (Piper nigrum, Var. muntok), Z. Lebensm. Unters Forsch., 1992, 194, 6, 545-551, https://doi.org/10.1007/BF01185481 . [all data]

Brophy, Davies, et al., 1989
Brophy, J.J.; Davies, N.W.; Southwell, I.A.; Stiff, I.A.; Williams, L.R., Gas chromatographic quality control for oil of Melaleuca terpinen-4-ol type (Australian tea tree), J. Agric. Food Chem., 1989, 37, 5, 1330-1335, https://doi.org/10.1021/jf00089a027 . [all data]