8-Oxabicyclo[5.1.0]octane

Condensed phase thermochemistry data

Data compiled by: Hussein Y. Afeefy, Joel F. Liebman, and Stephen E. Stein

Quantity Value Units Method Reference Comment
Δfliquid-197.5 ± 3.1kJ/molCcbKozina, Timofeeva, et al., 1988
Quantity Value Units Method Reference Comment
Δcliquid-4272.1 ± 3.1kJ/molCcbKozina, Timofeeva, et al., 1988Corresponding Δfliquid = -197.5 kJ/mol (simple calculation by NIST; no Washburn corrections)

Gas phase thermochemistry data

Data compiled by: Hussein Y. Afeefy, Joel F. Liebman, and Stephen E. Stein

Quantity Value Units Method Reference Comment
Δfgas-152.3 ± 3.1kJ/molCcbKozina, Timofeeva, et al., 1988

References

Kozina, Timofeeva, et al., 1988
Kozina, M.P.; Timofeeva, L.P.; Luk'Yanova, V.A.; Pimenova, S.M.; Kas'yan, L.I., Enthalpies of formation and some alicyclic epoxy compounds, Russ. J. Phys. Chem. (Engl. Transl.), 1988, 62, 609-612. [all data]