Furan, 3,3'-dithiobis[2-methyl-

Van Den Dool and Kratz RI, non-polar column, temperature ramp

View large format table.

Column type Active phase I Reference Comment
CapillaryCP Sil 8 CB1527.Mahadevan and Farmer, 200660. C @ 5. min, 4. K/min, 220. C @ 30. min; Column length: 50. m; Column diameter: 0.32 mm
CapillaryCP Sil 8 CB1552.Elmore, Campo, et al., 200260. m/0.25 mm/0.25 μm, He, 40. C @ 2. min, 4. K/min; Tend: 280. C
CapillaryBPX-51541.Ames, Guy, et al., 200150. m/0.32 mm/0.5 μm, He, 60. C @ 5. min, 4. K/min, 250. C @ 10. min
CapillaryDB-5MS1535.Baek, Kim, et al., 200160. m/0.25 mm/0.25 μm, He, 40. C @ 5. min, 3. K/min, 200. C @ 60. min
CapillaryDB-51540.Madruga and Mottram, 199830. m/0.32 mm/1. μm, 60. C @ 5. min, 4. K/min, 250. C @ 20. min
CapillaryOV-1011510.Misharina, Aerove, et al., 199150. m/0.32 mm/0.50 μm, He, 2. K/min; Tstart: 50. C; Tend: 250. C

Van Den Dool and Kratz RI, non-polar column, custom temperature program

View large format table.

Column type Active phase I Reference Comment
CapillarySE-541526.Hofmann and Schieberle, 199830. m/0.32 mm/0.25 μm; Program: 35C(2min) => 40C/min => 50C(5min) => 6C/min => 230C(15min)
CapillaryDB-51547.Mottram and Whitfield, 1995He; Column length: 50. m; Column diameter: 0.32 mm; Program: 0C => 60C/min => 60C (5min) => 4C/min => 250C

Van Den Dool and Kratz RI, polar column, temperature ramp

View large format table.

Column type Active phase I Reference Comment
CapillaryCP-Wax 52CB2124.Mahadevan and Farmer, 200660. C @ 5. min, 4. K/min, 220. C @ 30. min; Column length: 50. m; Column diameter: 0.32 mm

Van Den Dool and Kratz RI, polar column, custom temperature program

View large format table.

Column type Active phase I Reference Comment
CapillaryFFAP2100.Hofmann and Schieberle, 199830. m/0.32 mm/0.25 μm; Program: 35C(2min) => 40C/min => 60C(5min) => 6C/min => 230C(15min)
CapillaryCP-Wax 52CB2110.Madruga and Mottram, 199850. m/0.32 mm/0.21 μm; Program: 0C(5min) => fast => 60C(5min) => 4C/min => 220C(20min)

Normal alkane RI, non-polar column, custom temperature program

View large format table.

Column type Active phase I Reference Comment
CapillaryMethyl Silicone1508.Misharina, 1995Program: not specified

Normal alkane RI, polar column, custom temperature program

View large format table.

Column type Active phase I Reference Comment
CapillaryFFAP2140.Guth and Grosch, 1993Program: not specified

References

Mahadevan and Farmer, 2006
Mahadevan, K.; Farmer, L., Key Odor Impact Compounds in Three Yeast Extract Pastes, J. Agric. Food Chem., 2006, 54, 19, 7242-7250, https://doi.org/10.1021/jf061102x . [all data]

Elmore, Campo, et al., 2002
Elmore, J.S.; Campo, M.M.; Enser, M.; Mottram, D.S., Effect of lipid composition on meat-like model systems containing cysteine, ribose, and polyunsaturated fatty acids, J. Agric. Food Chem., 2002, 50, 5, 1126-1132, https://doi.org/10.1021/jf0108718 . [all data]

Ames, Guy, et al., 2001
Ames, J.M.; Guy, R.C.E.; Kipping, G.J., Effect of pH and temperature on the formation of volatile compounds in cysteine/reducing sugar/starch mixtures during extrusion cooking, J. Agric. Food Chem., 2001, 49, 4, 1885-1894, https://doi.org/10.1021/jf0012547 . [all data]

Baek, Kim, et al., 2001
Baek, H.H.; Kim, C.J.; Ahn, B.H.; Nam, H.S.; Cadwallader, K.R., Aroma extract dilution analysis of a beeflike process flavor from extruded enzyme-hydrolyzed soybean protein, J. Agric. Food Chem., 2001, 49, 2, 790-793, https://doi.org/10.1021/jf000609j . [all data]

Madruga and Mottram, 1998
Madruga, M.S.; Mottram, D.S., The effect of pH on the formation of volatile compounds produced by heating a model system containing 5'-imp and cysteine, J. Braz. Chem. Soc., 1998, 9, 3, 261-271, https://doi.org/10.1590/S0103-50531998000300010 . [all data]

Misharina, Aerove, et al., 1991
Misharina, T.A.; Aerove, A.F.; Golovnya, R.E.; Kalugina, V.I.; Rogovskaya, L.V.; Vysotskaya, L.E.; Shevtsov, V.K., Identification of volatile components of an aromatizer with a chicken odor by chromatography-mass spectrometry and chromatography-fourier transform infrared spectroscopy, J. Anal. Chem. USSR (Engl. Transl.), 1991, 8, 1187-1193. [all data]

Hofmann and Schieberle, 1998
Hofmann, T.; Schieberle, P., Identification of key aroma compounds generated from cysteine and carbohydrates under roasting conditions, Z. Lebensm. Unters. Forsch. A, 1998, 207, 3, 229-236, https://doi.org/10.1007/s002170050324 . [all data]

Mottram and Whitfield, 1995
Mottram, D.S.; Whitfield, F.B., Volatile compounds from the reaction of cysteine, ribose, and phospholipid in low-moisture systems, J. Agric. Food Chem., 1995, 43, 4, 984-988, https://doi.org/10.1021/jf00052a027 . [all data]

Misharina, 1995
Misharina, T.A., Sorption regularities of sulfur- and oxygen-containing compounds in chromatography and their application in identification of volatile organic compounds, Diss. degree of Dr. Sci. (Chemistry), 1995, 52. [all data]

Guth and Grosch, 1993
Guth, H.; Grosch, W., 12-Methyltridecanal, a species-specific odorant of stewed beef, Lebensm. Wiss. Technol., 1993, 26, 2, 171-177, https://doi.org/10.1006/fstl.1993.1035 . [all data]