1H-Cycloprop[e]azulene, decahydro-1,1,4,7-tetramethyl-, [1aR-(1aα,4β,4aβ,7β,7aβ,7bα)]-

Normal alkane RI, non-polar column, temperature ramp

View large format table.

Column type Active phase I Reference Comment
CapillaryAT-51373.Borges, Rojas, et al., 200660. m/0.25 mm/0.25 μm, He, 4. K/min, 200. C @ 20. min; Tstart: 60. C

Normal alkane RI, polar column, temperature ramp

View large format table.

Column type Active phase I Reference Comment
CapillaryCarbowax 20M1958.Vernin, Lageot, et al., 200150. m/0.22 mm/0.25 μm, He, 2. K/min; Tstart: 60. C; Tend: 220. C

References

Borges, Rojas, et al., 2006
Borges, R.; Rojas, L.B.; Cegarra, J.A.; Usubillaga, A., Study of the essential oils from the leaves and flowers of Lepechinia conferta (Benth) Epl., Flavour Fragr. J., 2006, 21, 1, 155-157, https://doi.org/10.1002/ffj.1550 . [all data]

Vernin, Lageot, et al., 2001
Vernin, G.; Lageot, C.; Gaydou, E.M.; Parkanyi, C., Analysis of the essential oil of Lippia graveolens HBK from El Salvador, Flavour Fragr. J., 2001, 16, 3, 219-226, https://doi.org/10.1002/ffj.984 . [all data]