Thiophene,2,2'-thiobis[3-bromo-

Gas phase ion energetics data

Data compiled by: Sharon G. Lias, Rhoda D. Levin, and Sherif A. Kafafi

Ionization energy determinations

IE (eV) Method Reference Comment
8.50PEMeunier and Pfister-Guillouzo, 1977Vertical value

References

Meunier and Pfister-Guillouzo, 1977
Meunier, P.; Pfister-Guillouzo, G., Etude conformationnelle par spectroscopie photoelectronique de sulfures de bithienyle, Can. J. Chem., 1977, 55, 3901. [all data]