2-Propenoic acid, 2-methyl-, pentyl ester

Kovats' RI, polar column, isothermal

Data compiled by: NIST Mass Spectrometry Data Center, William E. Wallace, director

Column type CapillaryCapillary
Active phase SP-1000SP-1000
Column length (m) 46.46.
Carrier gas N2N2
Substrate
Column diameter (mm) 0.230.23
Phase thickness (μm)
Temperature (C) 120.80.
I 1328.1314.
ReferenceHorna, Táborský, et al., 1985Horna, Táborský, et al., 1985
Comment MSDC-RI MSDC-RI

References

Horna, Táborský, et al., 1985
Horna, A.; Táborský, J.; Dufka, O.; Matousek, P.; Churácek, J., Chromatography of monomers. II. Glass capillary gas chromatography of C1-C18 alkyl esters of acrylic and methacrylic acids, J. Chromatogr., 1985, 325, 367-378, https://doi.org/10.1016/S0021-9673(00)96047-3 . [all data]