β-Acoradiene

Normal alkane RI, non-polar column, temperature ramp

Data compiled by: NIST Mass Spectrometry Data Center, William E. Wallace, director

Column type CapillaryCapillaryCapillaryCapillaryCapillary
Active phase CP-Sil 5 CBCP-Sil 5 CBHP-5HP-5MSZB-5
Column length (m) 30.30.30.30.30.
Carrier gas NitrogenNitrogenHeliumHe
Substrate
Column diameter (mm) 0.250.250.250.250.25
Phase thickness (μm) 0.250.250.320.250.25
Tstart (C) 50.50.60.60.40.
Tend (C) 200.200.250.240.300.
Heat rate (K/min) 5.5.5.3.2.
Initial hold (min)   30.
Final hold (min)
I 1475.1476.1468.1482.1478.
ReferenceHnawia, Menut, et al., 2009Hnawia, Menut, et al., 2009Yassa and Akhani, 2008Argyropoulou, Daferera, et al., 2007Biondi, Sari, et al., 2006
Comment MSDC-RI MSDC-RI MSDC-RI MSDC-RI MSDC-RI
Column type CapillaryCapillaryCapillaryCapillaryCapillary
Active phase DB-5BP-1DB-5MSSPB-5DB-5MS
Column length (m) 30.50.30.60.30.
Carrier gas HeliumHeHeHeHe
Substrate
Column diameter (mm) 0.250.220.250.320.25
Phase thickness (μm) 0.250.250.251.0.25
Tstart (C) 60.60.60.40.60.
Tend (C) 260.220.280.230.280.
Heat rate (K/min) 3.2.3.3.3.
Initial hold (min)    5.30.
Final hold (min)  20.30.2.
I 1462.1455.1455.1499.1440.
ReferenceJavidnia, Miri, et al., 2006Lesueur, Ban, et al., 2006Maronigiu, Piras, et al., 2006Tornambe, Cornu, et al., 2006Marongiu, Piras, et al., 2005
Comment MSDC-RI MSDC-RI MSDC-RI MSDC-RI MSDC-RI
Column type CapillaryCapillaryCapillaryCapillaryCapillary
Active phase DB-5CP Sil 5 CBCP Sil 5 CBHP-5MSHP-5
Column length (m) 30.30.30.30.30.
Carrier gas HeHeHeHeHe
Substrate
Column diameter (mm) 0.250.250.250.250.25
Phase thickness (μm) 0.250.250.250.250.25
Tstart (C) 60.40.40.60.60.
Tend (C) 220.220.220.280.280.
Heat rate (K/min) 4.4.4.3.3.
Initial hold (min) 4.1.1.
Final hold (min)
I 1471.1475.1475.1465.1446.
ReferenceMorteza-Semnani and Saeedi, 2005Rohloff and Bones, 2005Rohloff and Bones, 2005Slavkovska, Couladis, et al., 2005Pitarokili, Tzakou, et al., 2003
Comment MSDC-RI MSDC-RI MSDC-RI MSDC-RI MSDC-RI
Column type CapillaryCapillaryCapillary
Active phase DB-5DB-5CP Sil 5 CB
Column length (m) 30.30.25.
Carrier gas HeHeH2
Substrate
Column diameter (mm) 0.250.250.25
Phase thickness (μm) 0.250.250.15
Tstart (C) 60.60.50.
Tend (C) 240.240.320.
Heat rate (K/min) 3.3.3.
Initial hold (min)
Final hold (min)
I 1469.1470.1454.
Referenceda Silva, Luz, et al., 2003Zoghbi, Andrade, et al., 2003Asekun and Ekundayo, 1999
Comment MSDC-RI MSDC-RI MSDC-RI

Van Den Dool and Kratz RI, polar column, custom temperature program

Data compiled by: NIST Mass Spectrometry Data Center, William E. Wallace, director

Column type CapillaryCapillary
Active phase Carbowax 20MCarbowax 20M
Column length (m) 30.30.
Carrier gas HeHe
Substrate
Column diameter (mm) 0.250.25
Phase thickness (μm) 0.250.25
Program 60C(3min) => 4C/min => 160C => 10C/min => 280C60C(3min) => 4C/min => 160C => 10C/min => 280C
I 1674.1674.
ReferenceBortolomeazzi, Berno, et al., 2001Bortolomeazzi, Pizzale, et al., 2000
Comment MSDC-RI MSDC-RI

Van Den Dool and Kratz RI, non-polar column, temperature ramp

Data compiled by: NIST Mass Spectrometry Data Center, William E. Wallace, director

Column type CapillaryCapillaryCapillaryCapillaryCapillary
Active phase HP-5DB-5HP-5MSDB-5CP Sil 5 CB
Column length (m) 30.30.30.30.25.
Carrier gas N2HeHeHeHe
Substrate
Column diameter (mm) 0.250.320.250.250.25
Phase thickness (μm) 0.250.250.250.250.4
Tstart (C) 60.60.60.50.80.
Tend (C) 220.280.300.250.270.
Heat rate (K/min) 5.3.3.5.10.
Initial hold (min) 10.  2.
Final hold (min)
I 1465.1458.1463.1471.1465.
ReferenceFlamini, Tebano, et al., 2006Pavlovic, Tzakou, et al., 2006Silva-Brandão, Solferini, et al., 2006Su, Ho, et al., 2006Ziegenbein, Hanssen, et al., 2006
Comment MSDC-RI MSDC-RI MSDC-RI MSDC-RI MSDC-RI
Column type CapillaryCapillaryCapillaryCapillaryCapillary
Active phase HP-5DB-5HP-5DB-5HP-5MS
Column length (m) 30.30.30.30.30.
Carrier gas HeHeHeH2He
Substrate
Column diameter (mm) 0.250.250.250.250.25
Phase thickness (μm) 0.250.250.250.250.25
Tstart (C) 60.60.60.60.60.
Tend (C) 280.300.380.240.280.
Heat rate (K/min) 4.5.3.3.4.
Initial hold (min) 5.3.  5.
Final hold (min)
I 1466.1471.1452.1473.1462.
ReferenceSkaltsa, Demetzos, et al., 2003Bortolomeazzi, Berno, et al., 2001Couladis, Tsortanidou, et al., 2001Nogueira, Bittrich, et al., 2001Skaltsa, Mavrommati, et al., 2001
Comment MSDC-RI MSDC-RI MSDC-RI MSDC-RI MSDC-RI
Column type Capillary
Active phase DB-5
Column length (m) 30.
Carrier gas He
Substrate
Column diameter (mm) 0.25
Phase thickness (μm) 0.25
Tstart (C) 60.
Tend (C) 300.
Heat rate (K/min) 5.
Initial hold (min) 3.
Final hold (min)
I 1471.
ReferenceBortolomeazzi, Pizzale, et al., 2000
Comment MSDC-RI

Kovats' RI, non-polar column, temperature ramp

Data compiled by: NIST Mass Spectrometry Data Center, William E. Wallace, director

Column type CapillaryCapillaryCapillaryCapillary
Active phase HP-5MSCP Sil 8 CBDB-1DB-5
Column length (m) 30.30.50.30.
Carrier gas HeH2N2He
Substrate
Column diameter (mm) 0.250.250.250.26
Phase thickness (μm) 0.250.250.250.25
Tstart (C) 50.50.80.60.
Tend (C) 250.220.225.246.
Heat rate (K/min) 3.3.4.3.
Initial hold (min) 10.2.
Final hold (min) 5.
I 1478.1465.1459.1466.
ReferenceAsuming, Beauchamp, et al., 2005Schwob, Bessiere, et al., 2004Palá-Paúl, Velasco-Negueruela, et al., 2001Adams, 1999
Comment MSDC-RI MSDC-RI MSDC-RI MSDC-RI

References

Hnawia, Menut, et al., 2009
Hnawia, E.; Menut, C.; Agrebi, A.; Cabalion, P., Wood essential oil of two endemic trees from New Caledonia: Callitris sulcata (Parl.) Schltr. and Callitris neocaledonica Dummer, Biochem. Systematics Ecol., 2009, 36, 11, 859-866, https://doi.org/10.1016/j.bse.2008.08.007 . [all data]

Yassa and Akhani, 2008
Yassa, N.; Akhani, H., The essential oils composition in two species of the genus Eriocycla Lindl. (Apiaceae) from Iran, 2008, retrieved from http://biology.ut.ac.ir/members/akhani/PdfReprintNumber/27.pdf. [all data]

Argyropoulou, Daferera, et al., 2007
Argyropoulou, C.; Daferera, D.; Tarantilis, P.A.; Fasseas, C.; Polissiou, M., Chemical composition of the essential oil from leaves of Lippia citriodora H.B.K. (Verbenaceae) at two developmental stages, Biochem. Syst. Ecol., 2007, 35, 12, 831-837, https://doi.org/10.1016/j.bse.2007.07.001 . [all data]

Biondi, Sari, et al., 2006
Biondi, D.M.; Sari, M.i.; Ghani, Z.A.l.; Ruberto, G., Essential oil of Algerian Saccocalyx satureioides Coss. et Durieu, Flavour Fragr. J., 2006, 21, 3, 546-548, https://doi.org/10.1002/ffj.1661 . [all data]

Javidnia, Miri, et al., 2006
Javidnia, K.; Miri, R.; Kamalinejad, M.; Mehdipour, A.R., Composition of the essential oil of Diplotaenia cachrydifolia Boiss. from Iran, J. Ess. Oil Res., 2006, 18, 1, 86-87, https://doi.org/10.1080/10412905.2006.9699393 . [all data]

Lesueur, Ban, et al., 2006
Lesueur, D.; Ban, N.K.; Bighelli, A.; Muselli, A.; Casanova, J., Analysis of the root oil of Fokienia hodginsii (Dunn) Henry et Thomas (Cupressaceae) by GC, GC-MS and 13C-NMR, Flavour Fragr. J., 2006, 21, 1, 171-174, https://doi.org/10.1002/ffj.1557 . [all data]

Maronigiu, Piras, et al., 2006
Maronigiu, B.; Piras, A.; Porcedda, S.; Tuveri, E., Extraction of Santalum album and Boswellia carterii Birdw. volatile oil by supercritical carbon dioxide: influence of some process parameters, Flavour Fragr. J., 2006, 21, 4, 718-724, https://doi.org/10.1002/ffj.1718 . [all data]

Tornambe, Cornu, et al., 2006
Tornambe, G.; Cornu, A.; Pradel, P.; Kondjoyan, N.; Carnat, A.P.; Petit, M.; Martin, B., Changes in Terpene Content in Milk from Pasture-Fed Cows, J. Dairy Sci., 2006, 89, 6, 2309-2319, https://doi.org/10.3168/jds.S0022-0302(06)72302-5 . [all data]

Marongiu, Piras, et al., 2005
Marongiu, B.; Piras, A.; Porcedda, S.; Scorciapino, A., Chemical composition of the essential oil and supercritical CO2 extract of Commiphora myrrha (Nees) Engl. and of Acorus calamus L., J. Agric. Food Chem., 2005, 53, 20, 7939-7943, https://doi.org/10.1021/jf051100x . [all data]

Morteza-Semnani and Saeedi, 2005
Morteza-Semnani, K.; Saeedi, M., The essential oil composition of Hypericum androsaemum L. leaves and flowers from Iran, Flavour Fragr. J., 2005, 20, 3, 332-334, https://doi.org/10.1002/ffj.1432 . [all data]

Rohloff and Bones, 2005
Rohloff, J.; Bones, A.M., Volatile profiling of Arabidopsis thaliana - Putative olfactory compounds in plant communication, Phytochemistry, 2005, 66, 16, 1941-1955, https://doi.org/10.1016/j.phytochem.2005.06.021 . [all data]

Slavkovska, Couladis, et al., 2005
Slavkovska, V.; Couladis, M.; Bojovic, S.; Tzakou, O.; Pavlovic, M.; Lakusic, B.; Jancic, R., Essential oil and its systematic significance in species of Micromeria Bentham from Serbia Montenegro, Plant Systematics and Evolution, 2005, 255, 1-2, 1-15, https://doi.org/10.1007/s00606-005-0303-y . [all data]

Pitarokili, Tzakou, et al., 2003
Pitarokili, D.; Tzakou, O.; Loukis, A.; Harvala, C., Volatile metabolites from Salvia fruticosa as antifungal agents in soilborne pathogens, J. Agric. Food Chem., 2003, 51, 11, 3294-3301, https://doi.org/10.1021/jf0211534 . [all data]

da Silva, Luz, et al., 2003
da Silva, J.D.; Luz, A.I.R.; da Silva, M.H.L.; Andrade, E.H.A.; Soghbi, M.G.B.; Maia, J.G.S., Essential oils of the leaves and stems of four Psidium spp., Flavour Fragr. J., 2003, 18, 3, 240-243, https://doi.org/10.1002/ffj.1219 . [all data]

Zoghbi, Andrade, et al., 2003
Zoghbi, M.G.B.; Andrade, E.H.A.; da Silva, M.H.; Carreira, L.M.M.; Maia, J.G.S., Essential oils from three Myrcia species, Flavour Fragr. J., 2003, 18, 5, 421-424, https://doi.org/10.1002/ffj.1242 . [all data]

Asekun and Ekundayo, 1999
Asekun, O.T.; Ekundayo, O., Constituents of the leaf essential oil of Cedrela odorata L. from Nigeria, Flavour Fragr. J., 1999, 14, 6, 390-392, https://doi.org/10.1002/(SICI)1099-1026(199911/12)14:6<390::AID-FFJ850>3.0.CO;2-3 . [all data]