N-Nitroso-bis-(2,2-dinitropropyl)amine

Gas phase thermochemistry data

Data compiled by: Hussein Y. Afeefy, Joel F. Liebman, and Stephen E. Stein

Quantity Value Units Method Reference Comment
Δfgas-19.5 ± 1.3kcal/molCcbPepekin, Gafurov, et al., 1973Reanalyzed by Pedley, Naylor, et al., 1986, Original value = -18.5 ± 1.5 kcal/mol

Condensed phase thermochemistry data

Data compiled by: Hussein Y. Afeefy, Joel F. Liebman, and Stephen E. Stein

Quantity Value Units Method Reference Comment
Δfsolid-46.0 ± 1.3kcal/molCcbPepekin, Gafurov, et al., 1973Reanalyzed by Pedley, Naylor, et al., 1986, Original value = -45.0 kcal/mol
Quantity Value Units Method Reference Comment
Δcsolid-859.9 ± 1.3kcal/molCcbPepekin, Gafurov, et al., 1973

References

Pepekin, Gafurov, et al., 1973
Pepekin, V.I.; Gafurov, R.G.; Lebedev, Yu.A.; Eremenko, L.T.; Sogomonyan, E.M.; Apin, A.Ya., Thermochemistry of N-Nitrosoamines, Bull. Acad. Sci. USSR, Div. Chem. Sci., 1973, 304-307. [all data]

Pedley, Naylor, et al., 1986
Pedley, J.B.; Naylor, R.D.; Kirby, S.P., Thermochemical Data of Organic Compounds, Chapman and Hall, New York, 1986, 1-792. [all data]