Benzonitrile, 4-[2-[4-(dimethylamino)phenyl]ethenyl]-, (E)-

Gas phase ion energetics data

Data compiled as indicated in comments:
LBLHLM - Sharon G. Lias, John E. Bartmess, Joel F. Liebman, John L. Holmes, Rhoda D. Levin, and W. Gary Mallard

Ionization energy determinations

IE (eV) Method Reference Comment
7.31PECauletti, Furlani, et al., 1985Vertical value; LBLHLM

References

Cauletti, Furlani, et al., 1985
Cauletti, C.; Furlani, C.; Palma, A.; Piancastelli, M.N.; Schleinitz, K.D.; Gloyna, D., Electronic structure and free-energy relationships for some 4'-substituted 4-dimethylamino trans-stilbenes by U. V. photoelectron spectroscopy, J. Prakt. Chem., 1985, 327, 829. [all data]