3-Azabicyclo[3.2.2]nonane

Gas phase thermochemistry data

Data compiled by: Hussein Y. Afeefy, Joel F. Liebman, and Stephen E. Stein

Quantity Value Units Method Reference Comment
Δfgas-43.68 ± 0.79kJ/molCcrWong and Westrum, 1971see Westrum and Wong, 1967

References

Wong and Westrum, 1971
Wong, S.S.; Westrum, E.F., Jr., Enthalpies of formation of globular molecules. II. Three bicyclooctanes and two bicyclononanes, J. Am. Chem. Soc., 1971, 93, 5317-5321. [all data]

Westrum and Wong, 1967
Westrum, E.F., Jr.; Wong, S., Strain energies and thermal properties of globular and polynuclear aromatic molecules, AEC Rept. Coo-1149-92, Contract AT(11-1)-1149, 1967, 1-7. [all data]