2-(2,4-dinitrophenoxy)ethanol

Condensed phase thermochemistry data

Data compiled by: Hussein Y. Afeefy, Joel F. Liebman, and Stephen E. Stein

Quantity Value Units Method Reference Comment
Δfsolid-398.88 ± 0.92kJ/molCcrCarpenter, Zimmer, et al., 1971
Quantity Value Units Method Reference Comment
Δcsolid-3892.67 ± 0.92kJ/molCcrCarpenter, Zimmer, et al., 1971

References

Carpenter, Zimmer, et al., 1971
Carpenter, G.A.; Zimmer, M.F.; Baroody, E.E.; Robb, R.A., Enthalpy of formation of N,N,N'-trifluorohexaneamidine, (2-fluoro-2,2-dinitroethyl)acrylate,2,4-dinitrophenoxyethanol, and diisobutylazelate, J. Chem. Eng. Data, 1971, 16, 46-49. [all data]