.beta.-Oplopenone

Normal alkane RI, non-polar column, custom temperature program

Data compiled by: NIST Mass Spectrometry Data Center, William E. Wallace, director

Column type CapillaryCapillaryCapillaryCapillaryCapillary
Active phase DB-5DB-5CP Sil 8 CBDB-5HP-5MS
Column length (m) 30.30.50.30.30.
Carrier gas HeliumHeliumHeliumHydrogenHe
Substrate
Column diameter (mm) 0.250.250.320.250.25
Phase thickness (μm) 0.250.250.250.25
Program 35 0C 1 0C/min -> 60 0C 3 0C/min -> 170 0C 8 0C/min -> 200 0C 15 0C/min -> 280 0C (5 min)not specifiednot specifiednot specified40C(10min) => 3C/min => 200C => 2C/min => 220C
I 1568.1606.1608.1606.1610.
ReferenceGazim, Rezende, et al., 2008Gazim, Rezende, et al., 2008Kupcinskiene, Stikliene, et al., 2008Pontes, de Olivera, et al., 2007Takaku, Haber, et al., 2007
Comment MSDC-RI MSDC-RI MSDC-RI MSDC-RI MSDC-RI
Column type CapillaryCapillaryCapillaryCapillaryCapillary
Active phase CP Sil 8 CBHP-5MSCP Sil 8 CBCP Sil 8 CBCP Sil 5 CB
Column length (m) 50.30.50.50.25.
Carrier gas HeHeHeHeHe
Substrate
Column diameter (mm) 0.320.250.320.320.39
Phase thickness (μm) 0.250.250.250.25
Program 50C(5min) => 2C/min => 90C => 15C/min => 240C(4min)50C => 8C/min => 200C => 10C/min => 270C (5min)50C(5min) => 2C/min => 90C => 15C/min => 240C(4min)60C(1min) => 5C/min => 160C => 10C/min => 250C(5min)not specified
I 1607.1609.1607.1607.1588.
ReferenceButkienë, Nivinskienë, et al., 2005Deng, Yao, et al., 2005Butkienë, Nivinskienë, et al., 2004Mockute, Nivinskiene, et al., 2003Weyerstahl, Marschall, et al., 1999
Comment MSDC-RI MSDC-RI MSDC-RI MSDC-RI MSDC-RI
Column type CapillaryCapillary
Active phase CP Sil 5 CBCP Sil 5 CB
Column length (m) 25.25.
Carrier gas HeN2
Substrate
Column diameter (mm)
Phase thickness (μm) 0.390.39
Program not specifiednot specified
I 1589.1592.
ReferenceWeyerstahl, Marschall, et al., 1998Weyerstahl, Marschall, et al., 1998, 2
Comment MSDC-RI MSDC-RI

Normal alkane RI, polar column, temperature ramp

Data compiled by: NIST Mass Spectrometry Data Center, William E. Wallace, director

Column type CapillaryCapillaryCapillaryCapillaryCapillary
Active phase RTX-WaxHP-InnowaxInnowaxInnowaxDB-Wax
Column length (m) 60.30.50.60.60.
Carrier gas HeHeHeHeN2
Substrate
Column diameter (mm) 0.220.250.20.25
Phase thickness (μm) 0.250.250.2 0.25
Tstart (C) 60.60.70.60.60.
Tend (C) 230.240.220.220.220.
Heat rate (K/min) 2.2.4.4.5.
Initial hold (min)    10.
Final hold (min) 35.20. 10.
I 2051.2050.2129.2092.2096.
ReferencePaolini, Tomi, et al., 2008Hachicha, Skanji, et al., 2007Palá-Paúl, García-Jiménez, et al., 2004Suleimenov, Atazharova, et al., 2003Weyerstahl, Marschall, et al., 1999
Comment MSDC-RI MSDC-RI MSDC-RI MSDC-RI MSDC-RI
Column type Capillary
Active phase HP-Innowax FSC
Column length (m) 60.
Carrier gas He
Substrate
Column diameter (mm) 0.25
Phase thickness (μm) 0.25
Tstart (C) 60.
Tend (C) 220.
Heat rate (K/min) 4.
Initial hold (min) 10.
Final hold (min) 10.
I 2092.
ReferenceTümen, Baser, et al., 1998
Comment MSDC-RI

Kovats' RI, non-polar column, custom temperature program

Data compiled by: NIST Mass Spectrometry Data Center, William E. Wallace, director

Column type Capillary
Active phase HP-5
Column length (m) 30.
Carrier gas H2
Substrate
Column diameter (mm) 0.32
Phase thickness (μm) 0.25
Program 60 0C (8 min) 3 K/min -> 180 0C 20 K/min (20 min)
I 1605.
ReferenceFrizzo, Serafini, et al., 2001
Comment MSDC-RI

References

Gazim, Rezende, et al., 2008
Gazim, Z.C.; Rezende, C.M.; Fraga, S.R.; Filho, B.P.D.; Cortez, D.A.G., Analysis of the essential oils from Calendula officinalis growing in Brazil using three different exteraction procedures, Brazilian J. Pharmaceutical Sci., 2008, 44, 3, 391-395. [all data]

Kupcinskiene, Stikliene, et al., 2008
Kupcinskiene, E.; Stikliene, A.; Judzentiene, A., The essential oil guatitative composition in the needles of Pinus sylvestris L. growing along industrial transects, Environ. Pollution, 2008, 155, 3, 481-491, https://doi.org/10.1016/j.envpol.2008.02.001 . [all data]

Pontes, de Olivera, et al., 2007
Pontes, W.J.T.; de Olivera, J.C.G.; da Camara, C.A.G.; Lopes, A.C.H.R.; Gondim Jr.; de Olivera, J.V.; Barros, R.; Schwartz, M.O.E., Chemical composition and acaridical activity of the leaf and fruit essential oils of Protium heptaphyllum (Aubl.) Marchand (Burseraceae), Acta Amazonica, 2007, 37, 1, 103-110, https://doi.org/10.1590/S0044-59672007000100012 . [all data]

Takaku, Haber, et al., 2007
Takaku, S.; Haber, W.A.; Setzer, W.N., Leaf essential oil composition of 10 species of Ocotea (Lauraceae) from Monteverde, Costa Rica, Biochem. Syst. Ecol., 2007, 35, 8, 525-532, https://doi.org/10.1016/j.bse.2007.02.003 . [all data]

Butkienë, Nivinskienë, et al., 2005
Butkienë, R.; Nivinskienë, O.; Mockutë, D., α-Pinene chemotype of leaf (needle) essential oils of Juniperus communis L. growing wild in Vilnius district, Chemija, 2005, 16, 1, 53-60. [all data]

Deng, Yao, et al., 2005
Deng, C.; Yao, N.; Wang, A.; Zhang, X., Determination of essential oil in a traditional Chinese medicine, Fructus amomi by pressurized hot water extraction followed by liquid-phase microextraction and gas chromatography-mass spectrometry, Anal. Chim. Acta., 2005, 536, 1-2, 237-244, https://doi.org/10.1016/j.aca.2004.12.044 . [all data]

Butkienë, Nivinskienë, et al., 2004
Butkienë, R.; Nivinskienë, O.; Mockutë, D., Chemical composition of unripe and ripe berry essential oils of Juniperus communis L. growing wild in Vilnius district, Chemija, 2004, 15, 4, 57-63. [all data]

Mockute, Nivinskiene, et al., 2003
Mockute, D.; Nivinskiene, O.; Bernotiene, G.; Butkiene, R., The cis-thujone chemotype of Salvia officinalis L. essential oils, Chemija, 2003, 14, 4, 216-220. [all data]

Weyerstahl, Marschall, et al., 1999
Weyerstahl, P.; Marschall, H.; Son, P.T.; Giang, P.M., Constituents of the flower essential oil of Aglaia odorata Lour. from Vietnam, Flavour Fragr. J., 1999, 14, 4, 219-224, https://doi.org/10.1002/(SICI)1099-1026(199907/08)14:4<219::AID-FFJ815>3.0.CO;2-# . [all data]

Weyerstahl, Marschall, et al., 1998
Weyerstahl, P.; Marschall, H.; Weirauch, M.; Thefeld, K.; Surburg, H., Constituents of commercial Labdanum oil, Flavour Fragr. J., 1998, 13, 5, 295-318, https://doi.org/10.1002/(SICI)1099-1026(1998090)13:5<295::AID-FFJ751>3.0.CO;2-I . [all data]

Weyerstahl, Marschall, et al., 1998, 2
Weyerstahl, P.; Marschall, H.; Thefeld, K.; Subba, G.C., Constituents of the essential oil from the rhizomes of Hedychium gardnerianum Roscoe, Flavour Fragr. J., 1998, 13, 6, 377-388, https://doi.org/10.1002/(SICI)1099-1026(199811/12)13:6<377::AID-FFJ755>3.0.CO;2-F . [all data]