Benzene, 1-dimethylamino-4-(2,2-dicyanoethenyl)

Gas phase ion energetics data

Data compiled by: Sharon G. Lias, John E. Bartmess, Joel F. Liebman, John L. Holmes, Rhoda D. Levin, and W. Gary Mallard

Ionization energy determinations

IE (eV) Method Reference Comment
7.6PEKatrib, El-Issa, et al., 1986
7.8PEKatrib, El-Issa, et al., 1986Vertical value

References

Katrib, El-Issa, et al., 1986
Katrib, A.; El-Issa, B.D.; Potts, A.W., The He(I) and x-ray photoelectron spectra of p-N,N-dimethylaminobenzal-malonitrile, Can. J. Chem., 1986, 64, 528. [all data]