2,4,6(1H,3H,5H)-Pyrimidinetrione, 1,3-dimethyl-5-(1-methylbutyl)-5-(2-propenyl)-

Kovats' RI, non-polar column, isothermal

View large format table.

Column type Active phase Temperature (C) I Reference Comment
PackedSE-30180.1680.Gambaro, Mariani, et al., 1982Gas Chrom P (100-120 mesh); Column length: 1.8 m
PackedSE-30180.1680.Gambaro, Mariani, et al., 1982Gas Chrom P (100-120 mesh); Column length: 1.8 m
PackedSE-30180.1680.Gambaro, Mariani, et al., 1982Gas Chrom P (100-120 mesh); Column length: 1.8 m
PackedSE-30180.1699.Gambaro, Mariani, et al., 1982Gas Chrom P (100-120 mesh); Column length: 1.8 m

Normal alkane RI, non-polar column, temperature ramp

View large format table.

Column type Active phase I Reference Comment
PackedSE-301670.MHA, 9999Nitrogen, Chromosorb G AW DMCS (80-100 mesh); Column length: 2. m; Tstart: 100. C; Tend: 300. C

References

Gambaro, Mariani, et al., 1982
Gambaro, V.; Mariani, R.; Marozzi, E., Flash alkylation for the identification of barbiturates in biological material, J. Anal. Toxicol., 1982, 6, 6, 321-323, https://doi.org/10.1093/jat/6.6.321 . [all data]

MHA, 9999
MHA, Directorate of ForensicScience., Forensic Toxicology, 9999. [all data]