2,4,6(1H,3H,5H)-Pyrimidinetrione, 5-ethyl-1,3-dimethyl-5-(3-methylbutyl)-

Kovats' RI, non-polar column, isothermal

Data compiled by: NIST Mass Spectrometry Data Center, William E. Wallace, director

Column type PackedPackedPackedPacked
Active phase SE-30SE-30SE-30SE-30
Column length (m) 1.81.81.81.8
Carrier gas
Substrate Gas Chrom P (100-120 mesh)Gas Chrom P (100-120 mesh)Gas Chrom P (100-120 mesh)Gas Chrom P (100-120 mesh)
Column diameter (mm)
Phase thickness (μm)
Temperature (C) 180.180.180.180.
I 1614.1617.1617.1630.
ReferenceGambaro, Mariani, et al., 1982Gambaro, Mariani, et al., 1982Gambaro, Mariani, et al., 1982Gambaro, Mariani, et al., 1982
Comment MSDC-RI MSDC-RI MSDC-RI MSDC-RI

References

Gambaro, Mariani, et al., 1982
Gambaro, V.; Mariani, R.; Marozzi, E., Flash alkylation for the identification of barbiturates in biological material, J. Anal. Toxicol., 1982, 6, 6, 321-323, https://doi.org/10.1093/jat/6.6.321 . [all data]