Benzene, 1-ethyl-3-(phenylmethyl)-

Lee's RI, non-polar column, custom temperature program

View large format table.

Column type Active phase I Reference Comment
CapillarySE-54274.7Peterman and Delfino, 199015. m/0.25 mm/0.25 μm, He; Program: 125 0C (15 min) 1 0C/min -> 131 0C 4 0C/min -> 247 0C 8 0C/min -> 280 0C (15 min)

References

Peterman and Delfino, 1990
Peterman, P.H.; Delfino, J.J., Identification of isopropylbiphenyl, alkyl diphenylmethanes, diisopropylnaphthalene, linear alkyl benzenes and other polychlorinated biphenyl replacement compounds in effluents, sediments and fish in the Fox River system, Wisconsin, Biomed. Environ. Mass Spectrom., 1990, 19, 12, 755-770, https://doi.org/10.1002/bms.1200191203 . [all data]