Propyne, 3-fluoro-

Gas phase ion energetics data

Data compiled by: Sharon G. Lias, Rhoda D. Levin, and Sherif A. Kafafi

Ionization energy determinations

IE (eV) Method Reference Comment
10.95PEBotter, Gounelle, et al., 1977Vertical value

References

Botter, Gounelle, et al., 1977
Botter, R.; Gounelle, Y.; Henry, Y.; Jullien, J.; Menes, F.; Solgadi, D., Photoelectron spectra of halogeno-3-propynes (XCH2≡CH) and halogeno- methylcyanides (XCH2C≡N) and comments on the attribution of fluorine IP, J. Electron Spectrosc. Relat. Phenom., 1977, 10, 393. [all data]