Butanedioic acid, ethyl 3-methylbutyl ester

Van Den Dool and Kratz RI, non-polar column, custom temperature program

Data compiled by: NIST Mass Spectrometry Data Center, William E. Wallace, director

Column type CapillaryCapillary
Active phase HP-5MS5 % Phenyl methyl siloxane
Column length (m) 30.30.
Carrier gas He
Substrate
Column diameter (mm) 0.250.19
Phase thickness (μm) 0.25
Program 60C (1 min) => 5 C/min => 210C => 10 C/min => 280C (15 min)20C => 5C/min => 120C => 10C/min => 280C
I 1432.61430.
ReferenceAndriamaharavo, 2014Zaikin, 2008
Comment MSDC-RI MSDC-RI

Van Den Dool and Kratz RI, polar column, custom temperature program

Data compiled by: NIST Mass Spectrometry Data Center, William E. Wallace, director

Column type Capillary
Active phase DB-Wax
Column length (m) 60.
Carrier gas He
Substrate
Column diameter (mm) 0.25
Phase thickness (μm) 0.25
Program 35C(0.7min) => 20C/min => 70C => 4C/min => 240C
I 1892.
ReferenceFerrari, Lablanquie, et al., 2004
Comment MSDC-RI

References

Andriamaharavo, 2014
Andriamaharavo, N.R., Retention Data. NIST Mass Spectrometry Data Center., NIST Mass Spectrometry Data Center, 2014. [all data]

Zaikin, 2008
Zaikin, V.G., Personal Communication: Retention indices measured during the period 2007 to 2008, 2008. [all data]