2,6-Octadiene, 2,6-dimethyl-

Kovats' RI, non-polar column, isothermal

View large format table.

Column type Active phase Temperature (C) I Reference Comment
PackedSqualane100.977.Adlard, Evans, et al., 1965He, Celite; Column length: 1. m
PackedSqualane65.977.Adlard, Evans, et al., 1965He, Celite; Column length: 1. m
PackedSqualane78.977.Adlard, Evans, et al., 1965He, Celite; Column length: 1. m
PackedSqualane100.979.Adlard, Evans, et al., 1965Ar, Celite; Column length: 1.2 m
PackedSqualane65.978.Adlard, Evans, et al., 1965Ar, Celite; Column length: 1.2 m
PackedSqualane78.979.Adlard, Evans, et al., 1965Ar, Celite; Column length: 1.2 m
PackedSqualane100.977.Adlard, Evans, et al., 1965Ar, Celite; Column length: 1.5 m
PackedSqualane65.977.Adlard, Evans, et al., 1965Ar, Celite; Column length: 1.5 m
PackedSqualane78.978.Adlard, Evans, et al., 1965Ar, Celite; Column length: 1.5 m
PackedSqualane100.978.Adlard, Evans, et al., 1965Mixture, Celite; Column length: 1.5 m
PackedSqualane65.977.Adlard, Evans, et al., 1965Mixture, Celite; Column length: 1.5 m
PackedSqualane78.978.Adlard, Evans, et al., 1965Mixture, Celite; Column length: 1.5 m
PackedSqualane100.979.Adlard, Evans, et al., 1965He, Celite; Column length: 0.9 m
PackedSqualane78.978.Adlard, Evans, et al., 1965He, Celite; Column length: 0.9 m
PackedSqualane100.986.Adlard, Evans, et al., 1965N2, Celite; Column length: 0.9 m
PackedSqualane65.985.Adlard, Evans, et al., 1965N2, Celite; Column length: 0.9 m
PackedSqualane78.986.Adlard, Evans, et al., 1965N2, Celite; Column length: 0.9 m
PackedSqualane100.980.Adlard, Evans, et al., 1965N2, Sterchamol; Column length: 4. m
PackedSqualane65.978.Adlard, Evans, et al., 1965N2, Sterchamol; Column length: 4. m
PackedSqualane78.979.Adlard, Evans, et al., 1965N2, Sterchamol; Column length: 4. m
PackedSqualane100.978.Adlard, Evans, et al., 1965H2, Celite; Column length: 0.9 m
PackedSqualane65.976.Adlard, Evans, et al., 1965H2, Celite; Column length: 0.9 m
PackedSqualane78.977.Adlard, Evans, et al., 1965H2, Celite; Column length: 0.9 m
PackedSqualane100.978.Adlard, Evans, et al., 1965
PackedSqualane65.977.Adlard, Evans, et al., 1965
PackedSqualane78.978.Adlard, Evans, et al., 1965

Kovats' RI, non-polar column, temperature ramp

View large format table.

Column type Active phase I Reference Comment
CapillaryDB-5990.Buchin, Salmon, et al., 200260. m/0.32 mm/1. μm, He, 40. C @ 5. min, 3. K/min, 230. C @ 2. min

References

Adlard, Evans, et al., 1965
Adlard, E.R.; Evans, M.B.; Butlin, A.G.; Evans, R.S.; Hill, R.; Huber, J.F.K.; Littlewood, A.B.; McCambley, W.G.; Smith, J.F.; Swanton, W.T.; Swoboda, P.A.T., Recommendations of the data sub-committee for the publication of retention data, J. Gas Chromatogr., 1965, 3, 9, 298-302, https://doi.org/10.1093/chromsci/3.9.298 . [all data]

Buchin, Salmon, et al., 2002
Buchin, S.; Salmon, J.-C.; Carnat, A.-P.; Berger, T.; Bugaud, C.; Bosset, J.O., Identification de composés monoterpéniques, sesquiterpéniques et benzéniques dans un lait d'alpage très riche en ces substances, Mitt. Lebensmittelunters. Hyg., 2002, 93, 199-216. [all data]