2,5-Dimethoxybenzoic acid

Gas phase thermochemistry data

Data compiled by: Hussein Y. Afeefy, Joel F. Liebman, and Stephen E. Stein

Quantity Value Units Method Reference Comment
Δfgas-138.3 ± 0.53kcal/molCcbJimenex, Roux, et al., 1996

Condensed phase thermochemistry data

Data compiled by: Hussein Y. Afeefy, Joel F. Liebman, and Stephen E. Stein

Quantity Value Units Method Reference Comment
Δfsolid-166.0 ± 0.50kcal/molCcbJimenex, Roux, et al., 1996
Quantity Value Units Method Reference Comment
Δcsolid-1022.0 ± 0.41kcal/molCcbJimenex, Roux, et al., 1996Corresponding Δfsolid = -166.0 kcal/mol (simple calculation by NIST; no Washburn corrections)

Phase change data

Data compiled as indicated in comments:
ALS - Hussein Y. Afeefy, Joel F. Liebman, and Stephen E. Stein
DRB - Donald R. Burgess, Jr.
AC - William E. Acree, Jr., James S. Chickos

Quantity Value Units Method Reference Comment
Δsub27.7 ± 0.2kcal/molVJimenex, Roux, et al., 1996ALS
Δsub27.75kcal/molN/AJimenex, Roux, et al., 1996DRB
Δsub27.7 ± 0.2kcal/molMEJimenex, Roux, et al., 1996Based on data from 324. - 342. K.; AC

Enthalpy of sublimation

ΔsubH (kcal/mol) Temperature (K) Method Reference Comment
27.1 ± 0.2333.MEJimenex, Roux, et al., 1996Based on data from 324. - 342. K.; AC

Normal alkane RI, non-polar column, isothermal

View large format table.

Column type Active phase Temperature (C) I Reference Comment
PackedApieson L140.1431.Hedin, Minyard, et al., 1967Nitrogen, Chromosorb W HMDS (60-80 mesh); Column length: 1.8 m

References

Jimenex, Roux, et al., 1996
Jimenex, P.; Roux, M.V.; Kulhanek, J.; Exner, O., Enthalpies of formation of methoxybenzoic acids and their dependence on structure, Struct. Chem., 1996, 7, 375-381. [all data]

Hedin, Minyard, et al., 1967
Hedin, P.A.; Minyard, J.P.; Thompson, A.C., Chromatographic and spectral analysis of phenolic acids and related compounds, J. Chromatogr., 1967, 30, 43-53, https://doi.org/10.1016/S0021-9673(00)84111-4 . [all data]