Benzene, 4-ethenyl-1,2-dimethyl-

Kovats' RI, non-polar column, isothermal

Data compiled by: NIST Mass Spectrometry Data Center, William E. Wallace, director

Column type Capillary
Active phase SE-30
Column length (m) 25.5
Carrier gas He
Substrate
Column diameter (mm) 0.5
Phase thickness (μm)
Temperature (C) 65.
I 1099.9
ReferenceSvob and Deur-Siftar, 1974
Comment MSDC-RI

References

Svob and Deur-Siftar, 1974
Svob, V.; Deur-Siftar, D., Kovats Retention Indices in the Identification of Alkylbenzene Degradation Products, J. Chromatogr., 1974, 91, 677-689, https://doi.org/10.1016/S0021-9673(01)97947-6 . [all data]