(Z)-3-Pentenoic acid ethyl ester

Gas phase thermochemistry data

Data compiled by: Hussein Y. Afeefy, Joel F. Liebman, and Stephen E. Stein

Quantity Value Units Method Reference Comment
Δfgas-387. ± 4.kJ/molCcbSchjanberg, 1938Heat of formation dervied by Cox and Pilcher, 1970

Condensed phase thermochemistry data

Data compiled by: Hussein Y. Afeefy, Joel F. Liebman, and Stephen E. Stein

Quantity Value Units Method Reference Comment
Δfliquid-432. ± 3.kJ/molCcbSchjanberg, 1938Heat of formation dervied by Cox and Pilcher, 1970
Quantity Value Units Method Reference Comment
Δcliquid-4037. ± 3.kJ/molCcbSchjanberg, 1938Reanalyzed by Cox and Pilcher, 1970, Original value = -4034. ± 3. kJ/mol; Corresponding Δfliquid = -432.2 kJ/mol (simple calculation by NIST; no Washburn corrections)

Phase change data

Data compiled as indicated in comments:
ALS - Hussein Y. Afeefy, Joel F. Liebman, and Stephen E. Stein
DRB - Donald R. Burgess, Jr.

Quantity Value Units Method Reference Comment
Δvap45. ± 1.kJ/molESchjanberg, 1938Heat of formation dervied by Cox and Pilcher, 1970; ALS
Δvap45.0kJ/molN/ASchjanberg, 1938DRB

References

Schjanberg, 1938
Schjanberg, E., Cis-pentensyreetylestrarnas forbranningsvarmen, refraktionsdata och alkaliska hydrolys, Svensk. Kim. Tidr., 1938, 50, 102-106. [all data]

Cox and Pilcher, 1970
Cox, J.D.; Pilcher, G., Thermochemistry of Organic and Organometallic Compounds, Academic Press, New York, 1970, 1-636. [all data]