Tricyclo[6.2.0.03,6]decane

Reaction thermochemistry data

Data compiled by: Hussein Y. Afeefy, Joel F. Liebman, and Stephen E. Stein

Individual Reactions

3Hydrogen + Tricyclo[6.2.0.0(3,6)]deca-1(8),2,6-triene = Tricyclo[6.2.0.0(3,6)]decane

By formula: 3H2 + C10H10 = C10H16

Quantity Value Units Method Reference Comment
Δr-58.6 ± 0.3kcal/molChydRoth, Langer, et al., 1991liquid phase; solvent: benzene

References

Roth, Langer, et al., 1991
Roth, W.R.; Langer, R.; Ebbrecht, T.; Beitat, A.; Lennartz, H.-W., 2,3,5,6-Tetramethylen-1,4-cyclohexadiyl, Chem. Ber., 1991, 124, 2751-2760. [all data]