Undec-10-ynoic acid

Phase change data

Data compiled as indicated in comments:
BS - Robert L. Brown and Stephen E. Stein
TRC - Thermodynamics Research Center, NIST Boulder Laboratories, Chris Muzny director

Quantity Value Units Method Reference Comment
Tfus316.4KN/ACrombie and Jacklin, 1957Uncertainty assigned by TRC = 1. K; TRC

Reduced pressure boiling point

Tboil (K) Pressure (atm) Reference Comment
438. - 440.0.004Farchan Laboratories, 1990BS

In addition to the Thermodynamics Research Center (TRC) data available from this site, much more physical and chemical property data is available from the following TRC products:

References

Crombie and Jacklin, 1957
Crombie, L.; Jacklin, Lipids Part V. Total Synthesis of Ximenynic Acid, Homoricinstearolic Acid, and Two Fatty Hydroxy-Acids with ALlenic Side Chains, J. Chem. Soc., 1957, 1957, 1622. [all data]

Farchan Laboratories, 1990
Farchan Laboratories, Research Chemicals Catalog, Farchan Laboratories, Gainesville, FL, 1990, 91. [all data]