Argentamin

Normal alkane RI, non-polar column, temperature ramp

Data compiled by: NIST Mass Spectrometry Data Center, William E. Wallace, director

Column type Capillary
Active phase SE-30
Column length (m) 15.
Carrier gas He
Substrate
Column diameter (mm) 0.26
Phase thickness (μm)
Tstart (C) 150.
Tend (C) 270.
Heat rate (K/min) 6.
Initial hold (min)
Final hold (min)
I 2650.
ReferenceWink, Witte, et al., 1983
Comment MSDC-RI

References

Wink, Witte, et al., 1983
Wink, M.; Witte, L.; Hartmann, T.; Theuring, C.; Volz. V., Accumulation of quinolizidine alkaloids in plants and cell suspension cultures: genera lupinus, cytisus, baptisia, genista, laburnum, and sophora, Planta Medica, 1983, 48, 4, 253-257, https://doi.org/10.1055/s-2007-969928 . [all data]