EtN radical

Gas phase ion energetics data

Data compiled by: John E. Bartmess

Electron affinity determinations

EA (eV) Method Reference Comment
1.87 ± 0.16PDRichardson, Stephenson, et al., 1974

References

Richardson, Stephenson, et al., 1974
Richardson, J.H.; Stephenson, L.M.; Brauman, J.I., Photodetachment of electrons from phenoxides and thiophenoxide, Chem. Phys. Lett., 1974, 25, 321. [all data]